program: Gaussian 09
title: 000254494
version: EM64L-G09RevD.01
frameworkgroup: C1[X(C10H18N2O6)]
method: RPBEPBE
basis: SDD
operation: Freq
keyword: #p
keyword: freq=noraman
keyword: PBEPBE/SDD
title: #p freq=noraman PBEPBE/SDD
converged: YES YES NO NO
title: Mulliken charges:
elementType: O O O O O O N N C C C C C C C C C C H H H H H H H H H H H H H H H H H H
charge: -0.269809 -0.200838 -0.212987 -0.245486 -0.216154 -0.184425 0.097041 0.121693 0.295746 -0.421512 0.226056 -0.548418 -0.722130 -0.695028 -0.278719 -0.684333 -0.696518 0.291785 0.243366 0.248474 0.267166 0.263780 0.233281 0.241425 0.229988 0.230042 0.219913 0.249276 0.228687 0.267960 0.220575 0.241932 0.248895 0.263983 0.203265 0.242026
chargesum: 0.00000
title: Mulliken charges with hydrogens summed into heavy atoms:
elementType: O O O O O O N N C C C C C C C C C C
charge: -0.269809 -0.200838 -0.212987 -0.245486 -0.216154 -0.184425 0.097041 0.121693 0.295746 0.070327 0.226056 -0.017471 -0.017436 0.004203 0.217928 0.027069 0.012757 0.291785
polarizability: 1.58897381e+02 -3.24720777e+00 1.39428311e+02 -1.02802557e+01 1.07895287e+00 1.30237279e+02
1716.lowfreq: -22.9576 -6.9212 0.0003 0.0006 0.0008 2.8829 7.7610 22.4531 26.7738
frequency: -17.8620 22.1435 26.7702 30.6273 36.6630 46.7797 83.5681 95.2881 144.9592 161.0380 186.8735 188.8379 212.9937 223.7157 230.7799 238.8110 245.4630 276.2387 288.5257 297.6386 308.0599 347.3636 357.0957 361.5102 385.0949 436.6727 481.8615 501.1967 507.6856 517.1260 533.9508 556.7688 644.2587 675.0067 681.9977 746.2703 760.5238 773.2036 809.8568 858.5085 899.3695 907.7241 937.8807 942.7062 944.0116 961.0755 978.8192 992.8432 1016.7692 1019.1127 1076.1375 1117.9148 1137.0819 1146.5795 1182.8274 1188.3793 1206.3716 1217.3490 1222.2942 1231.1366 1238.8030 1285.9807 1290.8760 1342.0044 1347.7402 1364.3455 1376.9603 1380.5930 1396.5295 1403.4346 1407.8927 1413.5688 1440.1422 1445.5955 1450.5849 1459.9641 1460.8049 1466.1554 1468.4994 1471.5021 1475.6944 1487.6088 1490.6856 1644.6299 2998.0502 2998.1144 2999.0907 3005.7769 3007.5523 3014.6247 3023.7306 3058.5833 3078.5636 3095.6744 3095.9993 3098.6299 3105.4081 3105.6006 3108.4341 3110.0087 3113.0375 3130.1187
redmass: 4.6376 5.4609 9.8315 8.7616 6.0540 11.9770 5.7275 4.2967 4.4349 3.0796 1.2310 1.0371 1.8816 1.7307 2.8303 1.3820 1.5474 3.5933 3.1575 3.1161 2.5940 3.0613 2.7290 2.8468 2.6735 3.2429 5.0128 4.4849 3.2717 3.4726 3.6691 3.1829 4.6288 6.6689 6.1062 4.8902 11.1176 4.5410 3.3665 3.2210 2.3236 2.4989 1.6911 1.4539 1.8796 1.8627 1.9068 1.8260 1.4243 1.3859 2.8924 2.1316 2.3374 1.7310 2.0938 2.4522 1.5570 5.8668 9.6369 2.1028 1.5430 2.7005 1.7923 1.3735 1.4328 1.6290 1.5753 1.2710 2.3049 1.4778 1.3976 3.1344 1.0999 1.0777 1.0739 1.0737 1.0637 1.0959 1.0697 1.0538 1.0615 1.0538 1.0529 9.3402 1.0354 1.0352 1.0633 1.0363 1.0381 1.0611 1.0577 1.0963 1.1022 1.1003 1.1058 1.1001 1.1000 1.0986 1.1014 1.1001 1.1002 1.1008
irintensity: 0.9587 2.1767 0.2390 0.0747 2.9327 0.5281 5.1578 2.5318 4.1336 0.2021 0.0174 0.1057 1.8658 2.7236 1.2972 0.0188 0.2398 8.5121 0.4433 2.2530 13.4806 1.7336 8.3438 9.3641 0.5302 0.1439 6.4523 3.9518 2.5397 5.0998 2.6724 3.7178 1.1883 1.0809 0.1954 8.3385 26.6678 15.7576 1.4255 12.7252 1.0098 4.6016 0.2177 5.6981 22.1569 18.2965 15.1101 32.4454 2.9791 0.5976 37.0696 225.8566 202.0979 9.1109 2.8669 12.0358 32.1154 46.2329 60.7682 29.5318 10.6768 10.3788 5.9799 6.3713 6.8945 58.4323 121.9856 61.9930 58.3498 67.0750 13.4958 67.3109 27.7597 2.9776 2.4804 24.9817 6.2290 5.8663 3.4867 15.8657 12.5767 33.4544 30.1332 143.5140 13.9813 8.8227 10.8284 9.5617 11.3165 10.6086 15.7168 3.9355 3.3326 8.6797 1.8637 3.9403 38.2414 18.6626 12.4014 12.5218 15.2589 13.2070
temp: 298.150 k
press: 1.00000 atm
elementType: 8 8 8 8 8 8 7 7 6 6 6 6 6 6 6 6 6 6 1 1 1 1 1 1 1 1 1 1 1 1 1 1 1 1 1 1
symmnumber: 1
zpe: 746264.6 jmol-1
zpe.correction: 0.284237 hartree
zpe.thermalcorrener: 0.304205 hartree
zpe.thermalcorrenthalpy: 0.305149 hartree
zpe.thermalcorrgfe: 0.233561 hartree
zpe.sumelectzpe: -951.129443 hartree
zpe.sumelectthermal: -951.109476 hartree
zpe.sumelectthermalent: -951.108532 hartree
zpe.sumelectthermalfe: -951.180120 hartree
dipole: -0.4034 -3.6579 3.5460
dipole: 5.1105
quadrupole: -107.8917 -121.8856 -106.6223
quadrupole: -7.9174 -14.1585 0.4968
quadrupole: 4.2415 -9.7524 5.5109 -7.9174 -14.1585 0.4968
hfenergy: -951.4136805 hartree
pointgroup: C01 [X(C10H18N2O6)]
dipole: -0.1337816 -1.8965876 0.6539642 debye
polarizability: 159.9888749|1.8843611|137.1003015|-9.1775994|3.9569563|131.4737948 unknown
InChI: InChI=1S/C10H18N2O6/c1-9(2,11(14)15)6-5-8(13)18-7-10(3,4)12(16)17/h5-7H2,1-4H3
charge 0 multiplicity 1
36 atoms
O  -1.040461 -0.210166 -0.17981
O  2.929713 1.445892 2.006053
O  4.298421 1.929887 0.257375
O  0.305311 -1.967663 -0.895278
O  -3.916649 0.186676 -1.781888
O  -3.979244 1.872655 -0.25691
N  3.55635 1.122815 0.930976
N  -3.776625 0.653395 -0.590544
C  3.387897 -0.338524 0.357883
C  2.629098 -0.166382 -0.992422
C  -3.367347 -0.382625 0.528759
C  1.18007 0.356105 -0.887203
C  2.635529 -1.189343 1.390893
C  4.813062 -0.874888 0.098917
C  -2.165699 -1.166683 -0.022559
C  -4.576891 -1.336538 0.677621
C  -3.047773 0.372812 1.825312
C  0.157163 -0.746728 -0.664421
H  2.616621 -1.156026 -1.485298
H  3.223836 0.51674 -1.624092
H  1.056589 1.127382 -0.105559
H  0.90078 0.851899 -1.837876
H  3.223082 -1.292096 2.318631
H  1.662414 -0.749918 1.661735
H  2.462251 -2.191307 0.962463
H  5.391624 -0.93665 1.037149
H  4.739239 -1.890748 -0.327003
H  5.356932 -0.228522 -0.608701
H  -1.874543 -1.962407 0.686373
H  -2.396435 -1.616544 -1.002554
H  -4.346273 -2.107163 1.433834
H  -5.466926 -0.780332 1.017872
H  -4.813762 -1.832601 -0.278604
H  -2.203857 1.065584 1.686855
H  -2.778113 -0.361919 2.605325
H  -3.919784 0.949432 2.171794
