program: Gaussian 09
title: 000250393
version: EM64L-G09RevD.01
frameworkgroup: C1[X(C12H16N2O4)]
method: RPBEPBE
basis: SDD
operation: Freq
keyword: #p
keyword: freq=noraman
keyword: PBEPBE/SDD
title: #p freq=noraman PBEPBE/SDD
converged: YES YES NO NO
title: Mulliken charges:
elementType: O O O O N N C C C C C C C C C C C C H H H H H H H H H H H H H H H H
charge: -0.299701 -0.384393 -0.459439 -0.229163 -0.165327 -0.506528 -0.346979 -0.410004 0.287509 0.554096 -0.654911 -0.647457 -0.666928 -0.363130 0.201445 0.151207 -0.276696 0.100595 0.206453 0.262515 0.238995 0.213903 0.314724 0.253022 0.201573 0.218877 0.215933 0.232488 0.222929 0.206271 0.315263 0.282329 0.352059 0.378467
chargesum: 0.00000
title: Mulliken charges with hydrogens summed into heavy atoms:
elementType: O O O O N N C C C C C C C C C C C C
charge: -0.299701 -0.032334 -0.080972 -0.229163 -0.165327 -0.191804 0.121989 0.042894 0.287509 0.554096 0.018562 0.023893 -0.460657 -0.047868 0.201445 0.151207 0.005634 0.100595
polarizability: 2.77772768e+02 -2.61567093e+00 1.66429417e+02 7.42422498e-01 8.13381815e+00 8.71527287e+01
1716.lowfreq: -10.7804 -3.5920 0.0006 0.0007 0.0009 6.6839 14.3055 32.8275 43.3131
frequency: 13.0380 32.7350 43.2330 48.2259 69.8775 87.1868 91.8510 115.3786 136.8370 188.6154 210.4845 223.3080 228.1068 229.0209 275.0961 289.5649 318.6822 346.8171 377.4234 387.3915 400.7419 427.3872 450.9147 500.2417 515.3487 547.0607 560.4084 568.3661 593.3159 619.7889 633.4661 677.6385 701.8521 708.8875 745.8053 753.5575 778.7568 781.3195 821.9601 839.2181 872.1062 912.7379 938.7744 977.3087 983.9781 1003.7556 1042.1201 1073.4819 1081.2122 1094.8568 1099.2874 1151.7819 1154.8302 1171.6115 1213.0448 1215.8073 1246.9483 1291.7705 1298.0706 1303.1263 1321.2559 1336.6380 1353.4659 1361.3143 1384.1617 1392.3049 1397.9566 1419.2858 1456.1241 1466.7519 1468.4242 1480.6267 1482.5154 1495.4329 1509.0662 1522.6407 1594.4451 1621.4177 1629.0641 1650.3782 2979.8986 2983.0853 2983.7814 3000.6739 3039.2890 3068.5061 3079.9143 3087.6469 3090.0456 3090.8135 3103.1799 3180.6829 3209.4189 3535.4348 3548.3934 3549.0172
redmass: 3.8063 5.2436 6.5775 3.7096 3.0179 6.4444 4.5030 3.4217 4.2725 2.6486 1.2303 3.9655 2.1931 2.1040 3.4774 3.9713 3.0737 4.0890 5.0282 1.1860 4.7314 3.4888 2.6454 3.2458 3.7963 1.3697 6.7121 1.2093 4.5793 4.2218 4.5892 2.9248 9.5711 5.1429 4.0547 3.1809 1.3717 1.1767 2.1321 3.2726 1.4513 3.1669 2.3822 5.5983 2.8678 1.3183 2.6422 2.0220 1.8875 1.7035 2.0248 2.1915 1.4253 1.4426 1.8782 2.1327 1.5643 1.5629 1.4099 2.6333 2.4526 1.3255 2.3638 1.3703 1.2196 1.3165 2.1129 5.4285 1.0858 1.0446 1.0463 1.0929 1.0585 1.6306 1.7030 2.1778 5.4892 4.3622 6.0882 8.5176 1.0617 1.0366 1.0386 1.0657 1.0980 1.0985 1.0999 1.0975 1.0996 1.0913 1.1019 1.0902 1.0955 1.0641 1.0748 1.0662
irintensity: 0.1437 0.2232 1.0856 1.2346 0.4904 5.0106 1.1553 2.0319 2.7951 0.7332 0.5624 3.3307 0.5459 0.1087 4.6710 7.1507 0.4486 22.4140 3.7343 102.0851 2.1657 18.7303 45.9582 10.0591 34.8506 73.8492 18.2369 54.4441 7.6038 21.0090 20.1015 67.0789 16.3169 6.9674 8.1685 1.8925 22.4045 2.4803 44.4082 3.4642 54.0326 33.4256 37.7674 316.1942 7.6369 0.5229 48.8639 23.4794 34.9287 20.0050 155.8118 147.0042 150.9085 53.3604 86.8286 16.3435 219.9575 75.0183 38.5094 116.7759 66.6783 12.0435 106.0313 12.8648 25.7081 53.4417 248.5436 49.8946 24.3328 2.7994 6.0286 58.6890 18.6212 463.1335 200.3501 4.3522 95.5272 88.5655 514.3694 440.4119 29.1822 41.5148 14.4379 43.5530 11.8825 17.9484 60.2013 33.1681 24.8515 21.8630 29.5378 1.8940 7.7859 44.5186 14.9164 26.2681
temp: 298.150 k
press: 1.00000 atm
elementType: 8 8 8 8 7 7 6 6 6 6 6 6 6 6 6 6 6 6 1 1 1 1 1 1 1 1 1 1 1 1 1 1 1 1
symmnumber: 1
zpe: 707821.8 jmol-1
zpe.correction: 0.269595 hartree
zpe.thermalcorrener: 0.288373 hartree
zpe.thermalcorrenthalpy: 0.289317 hartree
zpe.thermalcorrgfe: 0.220284 hartree
zpe.sumelectzpe: -875.944805 hartree
zpe.sumelectthermal: -875.926027 hartree
zpe.sumelectthermalent: -875.925083 hartree
zpe.sumelectthermalfe: -875.994116 hartree
dipole: -7.1179 4.0258 0.7407
dipole: 8.2110
quadrupole: -107.1392 -97.3127 -109.2606
quadrupole: -16.8475 -3.1215 0.6804
quadrupole: -2.5684 7.2581 -4.6897 -16.8475 -3.1215 0.6804
hfenergy: -876.2144004 hartree
pointgroup: C01 [X(C12H16N2O4)]
dipole: -2.7948433 1.5615852 0.4314501 debye
polarizability: 277.6248286|-1.7677829|165.857728|-5.7151441|10.5286489|87.8723564 unknown
InChI: InChI=1S/C12H16N2O4/c1-3-14(4-2)12(18)13-8-5-6-9(11(16)17)10(15)7-8/h5-7,13,15-16H,3-4H2,1-2H3
charge 0 multiplicity 1
34 atoms
O  -2.089477 -1.748128 -0.372903
O  3.270613 2.202023 0.394757
O  4.791355 -1.760915 -0.305756
O  5.396081 0.443542 0.080051
N  -3.561104 -0.012987 0.153211
N  -1.226904 0.398928 0.099552
C  -4.709177 -0.926699 -0.067973
C  -3.853847 1.354083 0.633717
C  -2.281133 -0.532901 -0.058672
C  0.162604 0.144855 0.041642
C  -5.145095 -1.661538 1.216929
C  -3.943886 2.407486 -0.497099
C  1.027877 1.254388 0.235348
C  0.72603 -1.141689 -0.191335
C  2.431503 1.102555 0.202526
C  3.013143 -0.182666 -0.025865
C  2.121089 -1.275257 -0.217956
C  4.475978 -0.39559 -0.065976
H  -5.544404 -0.3290 -0.48068
H  -4.40544 -1.663666 -0.829324
H  -4.820637 1.314055 1.167679
H  -3.110951 1.657218 1.3983
H  -1.481544 1.376025 0.246349
H  -4.322754 -2.298247 1.584219
H  -5.426104 -0.952444 2.017809
H  -6.01897 -2.306751 1.011477
H  -2.99279 2.503883 -1.052412
H  -4.722565 2.123631 -1.22661
H  -4.204791 3.399236 -0.084061
H  0.602829 2.252373 0.418038
H  0.066415 -1.994138 -0.351445
H  2.562845 -2.25883 -0.395434
H  2.736907 3.024846 0.538502
H  5.782604 -1.835779 -0.320904
