program: Gaussian 09
title: 000250392
version: EM64L-G09RevD.01
frameworkgroup: C1[X(C12H16N2O4)]
method: RPBEPBE
basis: SDD
operation: Freq
keyword: #p
keyword: freq=noraman
keyword: PBEPBE/SDD
title: #p freq=noraman PBEPBE/SDD
converged: YES YES NO NO
title: Mulliken charges:
elementType: O O O O N N C C C C C C C C C C C C H H H H H H H H H H H H H H H H
charge: -0.284939 -0.414333 -0.424926 -0.342238 -0.414635 -0.494230 -0.329007 -0.388510 -0.353195 -0.683495 0.546753 0.292867 -0.602820 -0.360027 0.106813 0.194107 -0.314811 0.163955 0.220325 0.197095 0.210913 0.261635 0.192513 0.189549 0.288285 0.215593 0.216875 0.211168 0.295779 0.245873 0.312712 0.268039 0.387923 0.388396
chargesum: 0.00000
title: Mulliken charges with hydrogens summed into heavy atoms:
elementType: O O O O N N C C C C C C C C C C C C
charge: -0.284939 -0.026410 -0.036530 -0.342238 -0.126350 -0.198451 0.088412 0.084038 0.028866 -0.039859 0.546753 0.292867 -0.356947 -0.047315 0.106813 0.194107 -0.046772 0.163955
polarizability: 2.89421626e+02 2.53671014e+00 1.53302280e+02 2.18579139e+01 -1.19498570e+01 9.56233100e+01
1716.lowfreq: -11.7790 0.0009 0.0009 0.0011 0.8230 6.7243 9.4233 24.2276 40.2907
frequency: 8.9427 22.3789 40.1644 56.6437 68.1196 97.2026 105.9869 116.7374 135.7737 200.0963 214.1982 231.7273 233.9834 242.5637 277.7785 293.6559 306.5180 349.0650 381.2407 402.6238 451.3055 453.1408 510.9727 518.3991 564.0798 567.7895 590.9531 610.3500 642.7279 683.2929 694.8177 705.3198 723.1532 734.0304 749.2463 771.1712 826.4611 849.7739 851.3768 855.8282 868.7340 909.4189 946.3664 974.4878 996.2114 1004.6006 1024.8375 1052.7485 1105.0795 1118.3628 1128.0111 1136.2700 1176.9452 1203.5109 1205.6330 1228.7678 1238.3608 1263.1878 1287.5846 1309.5686 1311.0062 1326.1464 1349.4645 1359.3751 1368.6776 1388.8830 1405.6214 1450.2194 1454.6354 1456.0363 1472.0641 1476.5030 1484.8670 1488.0627 1497.2576 1499.9158 1583.8166 1585.7681 1648.6982 1663.9149 2957.3315 2975.7620 2979.3130 2991.8539 3002.8478 3004.4338 3045.8381 3072.9903 3075.8449 3080.1832 3143.9559 3166.5438 3206.7727 3521.0434 3532.8511 3552.7280
redmass: 4.3498 3.7901 5.7863 1.7889 5.5450 4.2333 5.0584 5.3631 4.4471 5.1797 1.8474 1.6566 4.4070 3.9195 3.7815 3.5524 3.6954 3.3955 1.8324 3.8472 2.8079 6.7744 3.2715 3.7751 1.2361 6.4552 1.3744 5.1794 3.4062 3.3824 3.4132 9.3401 4.6830 1.4195 3.3313 3.2218 2.1160 1.3402 1.7541 1.2738 1.5980 2.2902 2.3258 1.7281 1.3014 3.1335 4.5240 2.7040 2.8701 2.0393 1.8252 1.8266 1.5671 1.5968 2.1384 1.3472 1.6680 1.3318 1.1053 1.3192 1.6655 2.9538 1.5110 2.7481 1.5519 1.2106 5.1929 1.2823 1.8272 1.1855 1.0720 1.0432 1.0996 1.6479 2.0830 3.6911 3.7577 5.6810 4.2899 4.9643 1.0586 1.0372 1.0595 1.0672 1.0984 1.0691 1.1009 1.1004 1.0996 1.0986 1.0919 1.0908 1.0952 1.0762 1.0641 1.0772
irintensity: 0.0919 0.5163 6.6496 0.0854 8.3031 1.7445 1.2828 1.4026 3.1455 2.2558 0.4546 1.2530 0.6500 1.3976 3.5300 6.7341 2.3327 25.8860 32.2354 11.5743 38.5391 6.4039 8.4353 18.1848 151.4348 3.9953 62.8634 34.1039 54.9905 41.8346 0.8396 9.2512 7.5006 20.9811 0.0044 0.9835 0.7032 153.2496 4.5397 75.2394 29.6618 1.9810 22.7574 19.4473 1.2557 45.1552 286.4602 9.3512 32.1792 29.2492 144.2200 18.9282 77.7020 318.5890 176.7934 42.0931 24.7084 90.0830 1.7735 60.7257 216.0338 57.0270 32.7299 307.2867 95.7117 8.5687 85.7083 159.0639 226.1996 32.7968 14.5105 9.1587 30.7985 122.7548 588.4918 174.5625 200.7009 51.7533 147.3352 533.1253 31.8012 26.2158 54.3220 53.0029 9.5315 279.6823 54.4789 75.8156 46.0005 11.5377 7.6174 1.7911 9.0243 6.1799 79.9932 27.2150
temp: 298.150 k
press: 1.00000 atm
elementType: 8 8 8 8 7 7 6 6 6 6 6 6 6 6 6 6 6 6 1 1 1 1 1 1 1 1 1 1 1 1 1 1 1 1
symmnumber: 1
zpe: 711177.0 jmol-1
zpe.correction: 0.270873 hartree
zpe.thermalcorrener: 0.289166 hartree
zpe.thermalcorrenthalpy: 0.290110 hartree
zpe.thermalcorrgfe: 0.221296 hartree
zpe.sumelectzpe: -875.974633 hartree
zpe.sumelectthermal: -875.956340 hartree
zpe.sumelectthermalent: -875.955395 hartree
zpe.sumelectthermalfe: -876.024209 hartree
dipole: -4.1479 1.3768 -0.5712
dipole: 4.4076
quadrupole: -91.1065 -110.8703 -107.1451
quadrupole: -18.2471 7.5931 -3.8070
quadrupole: 11.9342 -7.8297 -4.1045 -18.2471 7.5931 -3.8070
hfenergy: -876.2455056 hartree
pointgroup: C01 [X(C12H16N2O4)]
dipole: -1.6250442 0.5928905 -0.1217276 debye
polarizability: 289.7256295|-2.8357297|155.6504346|20.2947394|-2.5318056|92.9711523 unknown
InChI: InChI=1S/C12H16N2O4/c1-2-3-6-13-12(18)14-8-4-5-9(11(16)17)10(15)7-8/h4-5,7,13-16H,2-3,6H2,1H3
charge 0 multiplicity 1
34 atoms
O  -1.811808 -1.662296 -0.598739
O  3.60202 2.213677 0.043891
O  5.135491 -1.716005 0.597924
O  5.550402 0.560758 0.499477
N  -3.141555 0.234825 -0.902599
N  -0.837925 0.499619 -0.575451
C  -5.235404 -0.546272 0.281255
C  -4.394353 -0.533368 -1.016872
C  -5.740147 0.84791 0.71893
C  -6.61955 0.788874 1.986854
C  0.520492 0.20654 -0.327774
C  -1.923738 -0.404166 -0.682543
C  1.410173 1.307813 -0.259613
C  1.009758 -1.127391 -0.147257
C  3.28593 -0.231075 0.172933
C  2.781746 1.105767 -0.012585
C  2.372115 -1.320272 0.098543
C  4.707889 -0.403345 0.427828
H  -4.63471 -1.001649 1.092449
H  -6.106268 -1.213122 0.116694
H  -4.98978 -0.11217 -1.850653
H  -4.105139 -1.563276 -1.286713
H  -6.317175 1.306577 -0.111116
H  -4.873332 1.513713 0.91074
H  -3.202821 1.253664 -0.901726
H  -6.057159 0.361433 2.837801
H  -6.971981 1.793525 2.283645
H  -7.509245 0.153053 1.820404
H  -1.04636 1.493097 -0.698975
H  1.060526 2.337345 -0.394666
H  0.313384 -1.963828 -0.206695
H  2.762588 -2.332519 0.239131
H  4.553958 1.891334 0.229712
H  6.115977 -1.713071 0.764466
