program: Gaussian 09
title: 000250388
version: EM64L-G09RevD.01
frameworkgroup: C1[X(C5H4N4O4)]
method: RPBEPBE
basis: SDD
operation: Freq
keyword: #pfreq=noraman
keyword: PBEPBE/SDD
title: #p freq=noraman PBEPBE/SDD
converged: NO YES NO NO
title: Mulliken charges:
elementType: O O O O N N N N C C C C C H H H H
charge: -0.373948 -0.171869 -0.158617 -0.202687 -0.421462 -0.338432 -0.381266 -0.067534 -0.027828 0.174899 0.224156 0.061149 0.204787 0.359481 0.372763 0.377882 0.368527
chargesum: 0.00000
title: Mulliken charges with hydrogens summed into heavy atoms:
elementType: O O O O N N N N C C C C C
charge: -0.005421 -0.171869 -0.158617 -0.202687 -0.061981 0.034330 -0.003384 -0.067534 -0.027828 0.174899 0.224156 0.061149 0.204787
polarizability: 1.40082760e+02 -2.87951255e+00 9.15267611e+01 5.11569825e+00 -1.70306590e+00 5.38516370e+01
1716.lowfreq: -6.6958 -0.0012 -0.0010 -0.0009 6.1016 11.0569 88.1540 100.7829 158.9217
frequency: 88.1490 100.7819 158.9215 207.1361 219.3237 253.7810 261.5837 282.7974 339.8964 409.3959 431.1147 466.9715 545.1751 567.9583 579.7509 624.1520 649.7032 660.6448 703.7811 720.6576 721.6566 730.1183 778.4219 810.9227 841.6923 917.7046 965.3296 999.6179 1084.7939 1189.3178 1214.1316 1288.7261 1324.7235 1361.4204 1371.1238 1380.9993 1389.5621 1605.8248 1675.1772 1677.2496 1720.9884 3517.3191 3524.8130 3535.1234 3604.5188
redmass: 10.7858 10.8014 8.1787 7.4196 6.6102 6.2535 1.1607 7.6451 12.2588 6.5962 9.7755 7.0011 5.9220 8.8921 1.2589 2.8974 3.1673 2.2686 3.3808 5.9454 7.5348 4.7228 2.2459 5.9383 6.4150 4.8697 3.8761 5.5579 3.5524 3.2085 4.8068 2.2588 3.8956 2.6137 2.4344 2.1109 1.6902 8.5073 11.5658 5.3957 10.2299 1.0769 1.0662 1.0780 1.0807
irintensity: 0.5483 4.6558 5.4395 11.1547 2.5360 3.7195 90.5418 4.1889 13.1605 13.9052 9.4161 8.3302 13.4389 6.4341 126.3167 22.8302 68.4092 29.1431 4.8317 25.9946 3.6653 7.5493 220.7909 26.6309 50.2190 157.3004 14.6001 16.0734 26.8243 35.3174 222.2321 132.2292 269.8472 1.9884 41.1401 50.6887 22.5221 573.7498 93.8441 794.0224 164.9235 77.3476 22.0236 87.9090 82.0125
temp: 298.150 k
press: 1.00000 atm
elementType: 8 8 8 8 7 7 7 7 6 6 6 6 6 1 1 1 1
symmnumber: 1
zpe: 284130.8 jmol-1
zpe.correction: 0.108220 hartree
zpe.thermalcorrener: 0.118705 hartree
zpe.thermalcorrenthalpy: 0.119649 hartree
zpe.thermalcorrgfe: 0.072238 hartree
zpe.sumelectzpe: -711.922059 hartree
zpe.sumelectthermal: -711.911574 hartree
zpe.sumelectthermalent: -711.910630 hartree
zpe.sumelectthermalfe: -711.958040 hartree
dipole: 1.7259 0.4613 1.5073
dipole: 2.3374
quadrupole: -92.4804 -78.6679 -71.1078
quadrupole: -5.1689 -7.7324 -1.1668
quadrupole: -11.7284 2.0841 9.6443 -5.1689 -7.7324 -1.1668
hfenergy: -712.0302782 hartree
pointgroup: C01 [X(C5H4N4O4)]
dipole: -0.6763733 -0.185848 0.5947136 debye
dipolederiv: -0.3459855 0.0948586 0.0319971 0.0764754 -0.4452153 0.0888808 0.2057049 0.1644311 -0.7531901 -0.4900171 0.0382961 -0.0409368 0.1124032 -0.991852 -0.1921463 -0.0599442 -0.3029595 -0.3993511 -1.2853096 -0.1736686 0.2060715 0.0678212 -0.4410513 0.0255223 0.2212395 0.0488504 -0.3578358 -1.2223033 0.2840388 0.031103 0.2806471 -0.6819072 -0.0622991 -0.0033197 -0.0354793 -0.3615965 -0.819115 -0.2569178 0.2182735 -0.068949 -0.7315257 0.1367444 0.0196174 0.1220501 -0.6228308 -1.6817838 -0.1193186 -0.034989 -0.0063641 -0.4299006 -0.0512385 -0.0800691 -0.0866179 -0.3682826 -0.7171489 0.5728666 0.1053983 0.2439206 -1.2068535 -0.1892625 -0.0212303 -0.1407647 -0.373237 -1.3796649 0.2041681 0.0692695 0.1600052 -0.4259921 -0.0106508 0.1498092 -0.0189019 -0.2320906 0.5860159 -0.0541836 -0.1911044 -0.1842163 0.0307768 -0.0760289 -0.1894976 -0.1487202 0.8916594 1.5956624 -0.0911659 -0.1088455 -0.1738135 0.282511 -0.070497 -0.2106919 -0.1092818 0.0702173 0.9927312 -0.5142882 0.0470466 -0.2845423 1.2907136 0.3372356 0.2765769 0.4195196 0.3881411 2.01462 0.2269906 -0.3470268 -0.2611598 1.1688991 -0.168374 -0.3761533 -0.120818 0.3138185 2.0538359 -0.0854718 0.0561131 0.1703158 1.6060141 0.2927305 0.0093163 0.3173778 0.4388239 0.2261329 -0.0716543 0.0499465 -0.0288138 0.2181187 0.0156465 0.0578528 -0.0029597 0.3667427 0.1341846 -0.0037626 -0.0123465 -0.0500799 0.2808707 0.0081349 0.0481414 0.0186527 0.354182 0.2174198 0.0533186 -0.0165623 0.070911 0.192876 -0.0371922 0.0080613 -0.0737931 0.326398 0.1207254 -0.104106 -0.0634078 -0.1245609 0.2835177 -0.0472055 -0.0554138 -0.0505854 0.3184315 unknown
polarizability: 139.6123982|-4.3862297|91.5202211|-6.5948027|3.9004859|54.3285384 unknown
InChI: InChI=1S/C5H4N4O4/c10-2-5(13)1(6-3(11)8-2)7-4(12)9-5/h6,8-9,13H
charge 0 multiplicity 1
17 atoms
O  0.030333 -0.96299 1.770811
O  -0.705314 -2.546058 -0.857384
O  3.626344 0.388488 -0.547925
O  -3.258331 1.287496 -0.019768
N  1.704072 -0.916086 -0.028615
N  -0.93212 1.457504 0.151844
N  -1.971416 -0.633825 -0.379037
N  1.469644 1.417141 -0.153119
C  0.347591 -0.659289 0.355196
C  0.306384 0.858059 0.099676
C  -0.788498 -1.395859 -0.377676
C  2.422256 0.291664 -0.263256
C  -2.134628 0.737593 -0.049324
H  2.102799 -1.845918 -0.150511
H  -1.016612 2.477637 0.182359
H  -2.833916 -1.106357 -0.670945
H  0.793313 -0.654897 2.329374
