program: Gaussian 09
title: 000250384
version: EM64L-G09RevD.01
frameworkgroup: C1[X(C14H11Cl3)]
method: RPBEPBE
basis: SDD
operation: Freq
keyword: #p
keyword: freq=noraman
keyword: PBEPBE/SDD
title: #p freq=noraman PBEPBE/SDD
converged: YES YES NO NO
title: Mulliken charges:
elementType: Cl Cl Cl C C C C C C C C C C C C C C H H H H H H H H H H H
charge: 0.036841 0.031078 -0.062993 -0.332500 0.663344 0.512555 -0.663190 -0.369106 -0.349921 -0.410950 -0.366545 -0.222144 -0.245404 -0.224162 -0.248204 -0.230884 -0.240156 0.290442 0.318908 0.234775 0.240699 0.220853 0.258240 0.233011 0.228769 0.227305 0.237740 0.231598
chargesum: 0.00000
title: Mulliken charges with hydrogens summed into heavy atoms:
elementType: Cl Cl Cl C C C C C C C C C C C C C C
charge: 0.036841 0.031078 -0.062993 -0.042057 0.663344 0.512555 -0.344282 -0.369106 -0.115146 -0.170251 -0.145693 0.036097 -0.012393 0.004608 -0.020900 0.006856 -0.008558
polarizability: 2.07697957e+02 -4.37742404e-01 1.42168132e+02 -3.33403992e+00 6.64998372e+00 1.62264326e+02
1716.lowfreq: -6.2122 -0.0019 -0.0012 0.0009 3.0540 11.7199 24.8576 36.2216 43.7411
frequency: 24.7588 36.1603 43.7174 56.7343 77.4302 103.6150 140.9110 185.2028 217.2682 220.5322 229.5725 273.7340 300.7591 356.0721 391.7870 401.3981 432.4469 454.3136 487.5996 522.2627 584.1988 611.1904 617.5671 657.7272 697.0277 703.4021 712.8338 737.2946 756.6824 765.4038 822.0897 850.4250 855.0641 870.5900 924.1366 946.3782 977.0340 985.5679 990.2427 997.2053 1013.5336 1027.5146 1040.4765 1054.3620 1092.7331 1125.3832 1173.3096 1174.7705 1187.2478 1188.9236 1193.9471 1203.7069 1213.1471 1246.6746 1290.5400 1322.9841 1356.8877 1379.9216 1385.8328 1426.3135 1443.0960 1461.3737 1485.2673 1576.8016 1595.0352 1602.9376 1613.6213 3044.6751 3117.8854 3123.4625 3125.3733 3130.7495 3136.6635 3144.7867 3148.2922 3161.4883 3165.9289 3177.0782
redmass: 7.2598 4.9357 15.7512 5.5134 7.4101 8.7201 5.1391 10.4071 6.3318 7.3997 7.3488 5.4676 13.0924 5.7661 9.5493 2.8028 4.1441 3.5307 3.8068 4.3808 6.6952 5.2679 6.1541 6.8127 6.2308 1.7599 5.1801 2.8968 1.7941 1.7443 3.2289 1.3396 1.8120 2.2598 1.4703 1.3978 1.4032 1.3367 5.9276 1.3198 6.7367 2.5341 2.2379 3.2780 1.8265 1.7656 1.0827 1.0573 1.1776 2.2364 1.1562 1.8713 1.1811 1.7276 1.4245 1.3335 1.3950 4.7223 4.9238 2.1312 2.1451 2.4259 2.2302 6.0581 5.9856 6.9287 6.0785 1.0830 1.0873 1.0872 1.0882 1.0867 1.0911 1.0897 1.0959 1.0950 1.1015 1.0995
irintensity: 0.1886 0.0496 0.2071 0.6586 0.0429 0.1950 0.3444 0.8637 0.5397 2.2430 1.3958 2.1662 0.1445 2.7736 6.9956 0.3274 3.1946 16.0135 7.6718 0.4173 51.8016 33.3407 4.9432 29.5094 56.8727 40.6096 24.7532 55.2237 65.2714 29.5820 4.6176 0.5021 3.3071 4.0790 2.6191 0.9241 0.1627 0.0851 1.8854 0.0987 44.1376 5.1698 5.0194 7.7360 16.9173 4.8541 1.3621 0.0297 6.9010 0.6814 4.7463 0.5508 9.4170 6.5937 7.0333 8.5769 4.0844 0.2949 0.5095 18.5510 8.3630 35.5833 18.7251 7.7681 1.9994 1.9471 6.4683 4.5774 10.9165 2.0328 4.0150 2.8753 11.0308 6.6875 34.3490 13.8980 23.2593 12.3008
temp: 298.150 k
press: 1.00000 atm
elementType: 17 17 17 6 6 6 6 6 6 6 6 6 6 6 6 6 6 1 1 1 1 1 1 1 1 1 1 1
symmnumber: 1
zpe: 540539.0 jmol-1
zpe.correction: 0.205880 hartree
zpe.thermalcorrener: 0.221423 hartree
zpe.thermalcorrenthalpy: 0.222367 hartree
zpe.thermalcorrgfe: 0.160218 hartree
zpe.sumelectzpe: -1919.065964 hartree
zpe.sumelectthermal: -1919.050422 hartree
zpe.sumelectthermalent: -1919.049478 hartree
zpe.sumelectthermalfe: -1919.111627 hartree
dipole: 0.3000 -3.4033 -2.1661
dipole: 4.0453
quadrupole: -111.4331 -125.1126 -111.4462
quadrupole: 1.1365 0.6451 0.0375
quadrupole: 4.5642 -9.1153 4.5511 1.1365 0.6451 0.0375
hfenergy: -1919.2718448 hartree
pointgroup: C01 [X(C14H11Cl3)]
dipole: -0.062532 1.3729316 -0.8025755 debye
polarizability: 206.6318273|1.1063641|142.7835225|7.733999|-7.3781321|162.7150648 unknown
InChI: InChI=1S/C14H11Cl3/c15-12-9-5-4-8-11(12)13(14(16)17)10-6-2-1-3-7-10/h1-9,13-14H
charge 0 multiplicity 1
28 atoms
Cl -1.469581 -3.285557 -0.077345
Cl 1.560706 -3.072265 -0.288595
Cl 2.083176 -0.301089 2.578326
C  -0.081737 -0.862185 0.297093
C  1.118018 0.033334 -0.059162
C  -1.397253 -0.074071 0.170297
C  -0.051851 -2.152822 -0.54109
C  2.142316 0.348059 0.864577
C  1.229981 0.603243 -1.355659
C  -1.829803 0.679484 1.290596
C  -2.159892 -0.018193 -1.023296
C  3.240508 1.166295 0.534267
C  2.320721 1.41986 -1.715245
C  -2.993064 1.47611 1.220829
C  -3.326796 0.774659 -1.094347
C  3.332168 1.701432 -0.768826
C  -3.746048 1.528391 0.025157
H  0.02752 -1.172773 1.351487
H  -0.128064 -2.005222 -1.625704
H  0.436458 0.414443 -2.087615
H  -1.249477 0.642097 2.220465
H  -1.870558 -0.608572 -1.900805
H  4.008183 1.379132 1.283532
H  2.378998 1.839966 -2.724674
H  -3.312882 2.050817 2.097069
H  -3.91068 0.79968 -2.021233
H  4.184265 2.335661 -1.034404
H  -4.651433 2.142685 -0.031195
