program: Gaussian 09
title: 000018096
version: EM64L-G09RevD.01
frameworkgroup: C1[X(C6H14O4S)]
method: RPBEPBE
basis: SDD
operation: Freq
keyword: #p
keyword: freq=noraman
keyword: PBEPBE/SDD
title: #p freq=noraman PBEPBE/SDD
converged: YES YES NO NO
title: Mulliken charges:
elementType: S O O O O C C C C C C H H H H H H H H H H H H H H
charge: 1.146040 -0.384904 -0.384916 -0.510312 -0.463451 -0.004032 -0.004088 -0.654564 -0.666987 -0.667027 -0.654537 0.246126 0.246215 0.212684 0.243248 0.233394 0.212420 0.243075 0.233387 0.212420 0.243110 0.233372 0.212716 0.243210 0.233400
chargesum: 0.00000
title: Mulliken charges with hydrogens summed into heavy atoms:
elementType: S O O O O C C C C C C
charge: 1.146040 -0.384904 -0.384916 -0.510312 -0.463451 0.242094 0.242127 0.034762 0.021895 0.021875 0.034789
polarizability: 1.52508193e+02 -1.39675936e-02 1.03588519e+02 -1.96962670e-03 1.84057243e+00 8.74877363e+01
1716.lowfreq: -8.7687 -0.0012 -0.0008 -0.0001 9.1839 11.3209 30.0693 31.6500 50.6743
frequency: 29.9239 31.3345 50.6733 71.3089 91.0452 153.9217 176.6261 181.5319 184.6220 218.4672 230.5895 231.0862 267.6310 270.8025 338.9098 347.8005 367.4566 393.9197 429.0909 449.6848 486.4818 574.3780 583.2965 741.9312 763.6440 852.7903 883.8266 886.2262 929.1104 929.3695 939.5127 940.3156 970.5015 1089.6617 1100.2572 1146.1788 1151.0586 1173.3144 1175.3299 1307.2576 1309.3148 1335.0693 1337.8645 1380.2593 1380.9705 1398.8235 1399.1970 1450.6329 1450.8266 1460.6241 1461.0856 1469.1725 1469.5631 1483.2441 1483.7373 2989.2585 2989.3311 2995.7025 2995.8473 3011.2851 3011.9897 3083.8362 3084.1167 3093.9374 3094.0357 3101.3021 3101.3817 3112.0240 3112.1634
redmass: 2.7306 3.7012 3.5345 4.9058 4.3143 5.1356 1.8974 1.0346 1.4726 1.7535 1.1309 2.6314 4.0210 2.9864 7.9437 2.5638 4.1485 3.3418 2.7689 2.9223 5.9516 7.6750 7.9852 4.1965 3.9950 11.5465 2.6987 2.8255 1.2360 1.2475 1.3184 1.3307 17.3419 1.6239 1.6698 2.1964 2.1831 1.9183 1.9341 1.2529 1.2632 1.3773 1.3730 1.2220 1.2266 1.2115 1.2119 1.0470 1.0472 1.0486 1.0487 1.0472 1.0474 1.0503 1.0503 1.0359 1.0359 1.0355 1.0355 1.0861 1.0864 1.0991 1.0990 1.0993 1.0993 1.1002 1.1002 1.1009 1.1009
irintensity: 0.0662 4.1551 1.2672 0.6894 1.4879 8.8127 0.2875 0.1765 0.2315 3.7285 0.3075 6.3221 1.3703 1.2969 12.4558 8.0493 8.0267 1.1199 0.2699 13.7655 49.7612 205.8220 17.8683 122.2278 0.8805 59.4934 11.7765 14.2527 0.2481 8.9779 6.1527 1.8783 88.7355 156.0020 22.8689 38.0581 8.3758 10.1100 7.8948 15.0188 5.6302 45.1406 0.6444 0.1644 50.6586 34.0445 13.2501 0.0586 16.4350 2.4471 3.1700 1.7149 20.9339 7.6757 23.6948 6.3691 14.1464 26.1511 8.4495 4.4133 18.3382 38.2825 9.0551 16.5420 7.1129 4.1025 45.4065 8.5356 42.3003
temp: 298.150 k
press: 1.00000 atm
elementType: 16 8 8 8 8 6 6 6 6 6 6 1 1 1 1 1 1 1 1 1 1 1 1 1 1
symmnumber: 1
zpe: 521496.8 jmol-1
zpe.correction: 0.198628 hartree
zpe.thermalcorrener: 0.213842 hartree
zpe.thermalcorrenthalpy: 0.214786 hartree
zpe.thermalcorrgfe: 0.155315 hartree
zpe.sumelectzpe: -934.881223 hartree
zpe.sumelectthermal: -934.866009 hartree
zpe.sumelectthermalent: -934.865064 hartree
zpe.sumelectthermalfe: -934.924535 hartree
dipole: 0.0014 2.0863 1.2123
dipole: 2.4130
quadrupole: -53.1842 -78.6976 -80.6679
quadrupole: -0.0062 0.0025 0.7404
quadrupole: 17.6657 -7.8477 -9.8180 -0.0062 0.0025 0.7404
hfenergy: -935.0798504 hartree
pointgroup: C01 [X(C6H14O4S1)]
dipole: -0.0001009 0.8400914 -0.4421536 debye
dipolederiv: 2.2866702 -0.0007527 -0.0017937 -0.0023073 1.3850188 -0.149479 -0.0017295 -0.0132886 1.243705 -1.1254161 0.0193278 -0.0272111 0.0929568 -0.4433691 0.0502041 -0.1020619 -0.0089462 -0.3895029 -1.124935 -0.0181281 0.0296491 -0.092058 -0.4430777 0.0502138 0.104354 -0.009507 -0.3898281 -0.6691361 0.0001388 0.0000887 0.0004677 -0.4784305 0.0054214 0.0004372 -0.0914653 -0.6281133 -0.6763282 -0.0001841 0.000409 -0.0001385 -0.6634375 0.0942669 0.0007734 0.1315854 -0.488376 0.9276232 -0.0462498 0.0450534 0.3833859 0.2661543 -0.0333981 0.4829079 -0.1467185 0.2513169 0.9248374 0.0444838 -0.0469609 -0.3819183 0.2678747 -0.0319147 -0.4878313 -0.1459322 0.2518057 -0.1131553 -0.0442809 0.0114711 -0.1541583 -0.1788657 0.0114048 -0.0497773 0.0481443 0.0477918 -0.228948 0.1207293 0.0137293 -0.0983503 -0.029321 -0.0275644 -0.212818 0.0545356 0.0779496 -0.227951 -0.1198512 -0.0134429 0.0975774 -0.0294458 -0.02834 0.2146566 0.0540866 0.0776051 -0.1125664 0.04431 -0.0107216 0.1538315 -0.1795855 0.0094886 0.0513398 0.0468315 0.0480301 -0.0180123 0.0036694 0.07202 -0.0551173 0.0355805 0.0009998 -0.0340337 0.0419846 -0.090909 -0.0179999 -0.0029793 -0.0722237 0.0552598 0.0351988 0.0016342 0.034055 0.0427847 -0.0903349 -0.1334064 -0.018015 -0.0942421 -0.003481 0.1102496 0.0199013 -0.1073687 0.0041825 0.0477007 0.0378796 0.1102557 0.0478793 0.0796498 -0.0379566 -0.0334907 0.0689043 -0.0318177 0.0676809 0.1064524 -0.0149939 0.0143552 -0.0023151 0.0700433 -0.0184526 0.0640963 0.028403 -0.1039695 -0.1270063 0.0407844 -0.0888916 0.0746006 0.0688214 -0.0246865 -0.0742963 -0.0187033 0.0440225 0.0828588 -0.11939 0.0302458 -0.0877279 -0.0709361 0.0284658 0.0372149 0.0278201 0.091034 0.1211257 -0.0010976 0.02402 -0.0105089 0.0876103 0.0511494 0.0724574 -0.0124093 -0.1070481 -0.126564 -0.0410179 0.0892399 -0.0746956 0.0693321 -0.0245044 0.0745003 -0.0185939 0.0430203 0.0830823 0.1193296 -0.0293781 0.0877866 -0.0716339 0.0272379 -0.0365888 0.0264314 0.0916708 0.1206189 0.0010692 -0.0248495 0.011007 0.087352 0.0523401 -0.0734761 -0.0111256 -0.1064468 -0.1325316 0.0180367 0.0950122 0.0035885 0.1100205 0.0200062 0.1080816 0.0041995 0.0471079 0.036691 -0.1103384 -0.0484397 -0.0798284 -0.0371551 -0.0335607 -0.0689645 -0.0320328 0.0676638 0.1061173 0.0151441 -0.015018 0.0024935 0.0699582 -0.0173433 -0.0648325 0.0295512 -0.1035763 unknown
polarizability: 152.5080925|-0.0399953|103.7143964|-0.0694632|-1.1599453|87.3619595 unknown
InChI: InChI=1S/C6H14O4S/c1-5(2)9-11(7,8)10-6(3)4/h5-6H,1-4H3
charge 0 multiplicity 1
25 atoms
S  -0.001848 -0.797489 0.147784
O  -1.323812 0.3535 0.682738
O  1.324575 0.347677 0.684192
O  -0.001785 -0.94634 -1.463235
O  -0.004551 -2.126952 1.050359
C  -2.596539 0.222003 -0.120186
C  2.593824 0.218047 -0.124449
C  -3.307652 -1.10293 0.181218
C  -3.376736 1.468009 0.323553
C  3.378629 1.459701 0.323394
C  3.302811 -1.110307 0.166659
H  -2.329023 0.293272 -1.192656
H  2.322366 0.295908 -1.195454
H  -4.277027 -1.134727 -0.349145
H  -2.712843 -1.971628 -0.152981
H  -3.493787 -1.20486 1.264235
H  -4.334439 1.51082 -0.226908
H  -2.804548 2.386329 0.112528
H  -3.593315 1.42619 1.404711
H  4.334034 1.50377 -0.230949
H  2.807515 2.380477 0.120317
H  3.599777 1.410982 1.403335
H  4.270088 -1.141486 -0.367551
H  2.70453 -1.975497 -0.170466
H  3.492756 -1.218968 1.248355
