program: Gaussian 09
title: 000250381
version: EM64L-G09RevD.01
frameworkgroup: C1[X(C13H12N4O3)]
method: RPBEPBE
basis: SDD
operation: Freq
keyword: #p
keyword: freq=noraman
keyword: PBEPBE/SDD
title: #p freq=noraman PBEPBE/SDD
converged: YES YES NO NO
title: Mulliken charges:
elementType: O O O N N N N C C C C C C C C C C C C C H H H H H H H H H H H H
charge: -0.257808 -0.221333 -0.221239 -0.389270 -0.169130 -0.011140 0.019914 0.483985 0.322866 -0.416685 -0.343567 -0.317807 -0.320903 0.170180 0.377879 -0.322426 -0.264520 -0.341548 -0.341622 -0.536876 0.226411 0.268570 0.246593 0.257591 0.256811 0.266397 0.286316 0.283776 0.310594 0.223528 0.223608 0.250856
chargesum: 0.00000
title: Mulliken charges with hydrogens summed into heavy atoms:
elementType: O O O N N N N C C C C C C C C C C C C C
charge: -0.257808 -0.221333 -0.221239 -0.078677 -0.169130 -0.011140 0.019914 0.483985 0.322866 -0.190274 -0.074997 -0.071215 -0.063312 0.170180 0.377879 -0.065615 0.001876 -0.055232 -0.057847 0.161117
polarizability: 6.06011978e+02 -5.76150380e+00 1.84193604e+02 -1.25050196e-01 -2.80083130e-01 7.33787449e+01
1716.lowfreq: -10.6919 -4.0940 -0.0011 -0.0004 0.0008 1.6287 19.9832 27.0291 35.3541
frequency: 19.5612 27.0239 35.3428 61.5413 72.1750 103.6946 131.2347 149.7936 178.6744 197.1706 203.1971 237.1722 237.8876 253.8833 334.1877 369.7800 373.4935 391.0448 412.9720 416.2158 459.5955 504.6038 511.7424 521.0147 524.5444 597.8867 625.3272 635.3392 659.1896 666.2566 721.2145 733.2982 743.2371 749.8272 777.3519 802.5365 818.6818 839.6947 846.0745 877.0974 913.9326 925.2991 972.0285 984.3642 992.2145 993.5567 995.6859 1000.4603 1094.0284 1105.4727 1111.6103 1112.2403 1154.9500 1159.5952 1170.0398 1175.7891 1211.5178 1220.6479 1230.7773 1275.4336 1290.2419 1303.2889 1328.2969 1351.6501 1380.3755 1400.2430 1432.3256 1434.8994 1437.4470 1466.7641 1468.4495 1471.3326 1486.7644 1513.0798 1578.1658 1588.7451 1602.9097 1626.6454 2962.1909 3051.9222 3126.7993 3130.5164 3163.3778 3164.7139 3166.8726 3168.6477 3185.7682 3187.8397 3189.3277 3370.5724
redmass: 4.1062 5.1046 7.1778 5.7981 7.1387 4.1354 6.4137 4.6595 5.8508 4.7175 2.3517 1.6762 6.1674 4.6315 6.6333 8.6488 5.7549 5.7114 3.0201 3.0718 4.8451 7.7343 3.2787 2.4548 5.7367 6.3699 7.1875 7.1644 7.6764 4.6792 3.6559 6.1086 2.7086 1.6439 8.2079 1.3410 6.5130 1.5318 1.2510 1.6804 4.5743 1.3773 1.3341 8.6609 1.3294 2.8961 2.5601 1.3418 3.3277 1.3039 1.2589 1.3723 1.3241 1.4114 2.0695 1.5956 5.5710 2.7269 4.2581 2.2274 1.4387 1.3506 7.3922 8.5845 6.4070 7.8946 4.1242 1.6127 2.1559 1.0502 2.1032 1.1494 1.9096 2.7807 7.8789 6.1691 6.4654 6.3566 1.0330 1.1042 1.0900 1.0992 1.0894 1.0889 1.0879 1.0941 1.0962 1.0967 1.0967 1.0742
irintensity: 0.8347 0.0357 0.2144 2.0457 0.0893 1.6609 1.0202 5.2228 0.0930 12.2289 0.7269 0.0332 0.6462 16.5358 0.0200 12.4727 2.9392 6.1706 0.0148 0.0042 1.7511 0.0361 11.7901 20.3298 14.4781 44.7530 0.9739 8.7284 8.3658 24.5352 0.2632 5.1145 25.8288 41.5547 28.0397 52.4825 2.4637 58.1421 0.8276 77.9471 0.1928 1.8834 0.1173 89.4507 0.6925 0.6099 18.0698 0.2005 40.3577 28.2962 0.1267 8.6627 6.6176 333.9722 15.9633 285.3390 1140.9599 423.3492 48.7778 4.9707 8.2951 27.2888 663.0822 97.7258 84.2106 31.0477 13.2115 31.5815 0.9227 14.8690 120.1246 35.5013 12.0986 335.2227 31.8607 63.4144 218.6433 62.9132 117.9338 46.4555 18.8195 18.3873 2.6324 4.0030 1.2494 20.8648 0.3608 1.8169 1.2769 45.0286
temp: 298.150 k
press: 1.00000 atm
elementType: 8 8 8 7 7 7 7 6 6 6 6 6 6 6 6 6 6 6 6 6 1 1 1 1 1 1 1 1 1 1 1 1
symmnumber: 1
zpe: 619966.9 jmol-1
zpe.correction: 0.236133 hartree
zpe.thermalcorrener: 0.253751 hartree
zpe.thermalcorrenthalpy: 0.254695 hartree
zpe.thermalcorrgfe: 0.188006 hartree
zpe.sumelectzpe: -945.696190 hartree
zpe.sumelectthermal: -945.678572 hartree
zpe.sumelectthermalent: -945.677628 hartree
zpe.sumelectthermalfe: -945.744318 hartree
dipole: 10.9345 -3.3556 -0.0088
dipole: 11.4378
quadrupole: -132.3213 -108.9940 -119.4575
quadrupole: 1.9816 0.2246 -0.0604
quadrupole: -12.0637 11.2636 0.8001 1.9816 0.2246 -0.0604
hfenergy: -945.9323233 hartree
pointgroup: C01 [X(C13H12N4O3)]
dipole: -4.3236759 1.062671 -0.6529487 debye
polarizability: 606.0478032|-1.2694762|151.2919747|-4.5504812|-50.5622243|106.2445494 unknown
InChI: InChI=1S/C13H12N4O3/c1-20-13-8-4-11(5-9-13)15-16-14-10-2-6-12(7-3-10)17(18)19/h2-9,15H,1H3
charge 0 multiplicity 1
32 atoms
O  -6.399658 -1.171926 0.869313
O  7.010078 0.127468 -0.102394
O  6.202975 -1.668302 1.055836
N  -1.44985 1.055971 -0.655753
N  0.746451 1.210919 -0.778665
N  -0.266287 0.503174 -0.304244
N  6.035338 -0.588097 0.361032
C  -2.689904 0.496754 -0.272966
C  -5.212473 -0.558746 0.45264
C  -3.879788 1.150397 -0.675454
C  -2.765479 -0.695763 0.498916
C  -5.140506 0.629232 -0.317041
C  -4.017731 -1.213464 0.855662
C  2.023982 0.686915 -0.446657
C  4.656643 -0.148323 0.082132
C  3.131088 1.436364 -0.938412
C  2.261522 -0.497101 0.318717
C  4.447675 1.026117 -0.678009
C  3.573311 -0.913085 0.582018
C  -7.664893 -0.541038 0.481249
H  -3.827036 2.070277 -1.270703
H  -1.845284 -1.197364 0.807299
H  -6.044535 1.152525 -0.640273
H  -4.100715 -2.128798 1.448927
H  2.925238 2.338516 -1.522302
H  1.409712 -1.070329 0.694421
H  5.310297 1.587384 -1.045544
H  3.785474 -1.813935 1.164055
H  -1.417736 1.919079 -1.223506
H  -7.772788 -0.502516 -0.620056
H  -7.749848 0.479793 0.901588
H  -8.447869 -1.183996 0.908178
