program: Gaussian 09
title: 000250380
version: EM64L-G09RevD.01
frameworkgroup: C1[X(C12H10N4O2)]
method: RPBEPBE
basis: SDD
operation: Freq
keyword: #p
keyword: freq=noraman
keyword: PBEPBE/SDD
title: #p freq=noraman PBEPBE/SDD
converged: YES YES NO NO
title: Mulliken charges:
elementType: O O N N N N C C C C C C C C C C C C H H H H H H H H H H
charge: -0.217402 -0.217453 -0.392663 -0.163997 0.020990 -0.006161 0.170982 0.379392 0.472809 -0.320865 -0.262468 -0.340225 -0.340443 -0.402973 -0.356741 -0.186836 -0.189179 -0.252541 0.258587 0.267716 0.287547 0.284866 0.227773 0.265369 0.232468 0.233051 0.312384 0.236013
chargesum: 0.00000
title: Mulliken charges with hydrogens summed into heavy atoms:
elementType: O O N N N N C C C C C C C C C C C C
charge: -0.217402 -0.217453 -0.080279 -0.163997 0.020990 -0.006161 0.170982 0.379392 0.472809 -0.062279 0.005248 -0.052678 -0.055577 -0.175200 -0.091372 0.045632 0.043872 -0.016528
polarizability: 4.89212943e+02 3.74327115e+00 1.72802296e+02 -2.72218967e-01 -1.00912027e-01 6.19501069e+01
1716.lowfreq: -4.3846 0.0004 0.0007 0.0010 3.7909 4.6157 21.2707 34.0453 43.8622
frequency: 20.9460 34.0276 43.8605 70.5222 82.8507 150.4732 173.8872 202.2495 210.7679 250.5455 259.6776 342.6800 386.6993 403.9114 405.1066 415.2072 506.0378 506.6354 513.9377 542.5633 610.1580 616.7185 639.9358 666.5080 667.2845 690.8719 741.6791 748.2326 766.1174 767.6237 813.2004 836.9306 846.8047 878.1334 910.5885 915.5750 972.7460 984.4088 992.6652 994.2727 994.3367 1000.7558 1021.7100 1082.4720 1092.9358 1105.6202 1159.2601 1170.9603 1174.1055 1182.4830 1210.6582 1223.1396 1264.5416 1288.6274 1323.2395 1336.7576 1354.4965 1389.5966 1400.8832 1430.7227 1439.9026 1469.6375 1479.8860 1508.3028 1580.5073 1598.5666 1603.8827 1611.4706 3123.5284 3138.6956 3150.8624 3164.5116 3167.3528 3169.4936 3184.0705 3186.1723 3189.5966 3376.1706
redmass: 4.3858 5.8765 6.6332 7.1462 6.4832 6.5945 6.5877 4.7247 7.8963 6.7825 5.0354 6.5297 7.3992 2.8786 7.1354 3.0350 7.4587 3.0517 3.3319 6.8058 6.5891 6.8707 7.1334 4.6668 7.8035 1.8611 1.8102 2.5164 1.6573 8.7254 6.4404 1.2567 1.2441 1.6791 1.4362 4.4999 1.3681 6.1199 1.3323 1.3196 2.8804 1.3450 2.1061 1.6410 3.2508 1.2679 1.4128 3.2692 1.0589 1.1513 6.0604 3.9850 2.1931 1.3465 1.4919 5.6866 8.3917 8.4893 8.0669 4.4231 2.2593 2.4238 2.0977 2.2709 7.8517 5.8229 6.4601 6.1107 1.0883 1.0871 1.0932 1.0894 1.0881 1.0982 1.0970 1.0962 1.0969 1.0743
irintensity: 0.1111 0.1993 0.3455 0.0025 1.3118 1.6006 0.2680 11.7798 1.3791 7.8374 2.0027 0.8343 7.3674 0.0025 0.6034 0.0016 1.6392 23.8398 1.6143 0.9563 12.1968 6.7685 26.5417 24.2973 2.1965 26.2016 47.7285 14.6439 119.1527 20.5776 11.4940 1.7640 0.2500 69.3503 13.0047 0.8193 0.0027 0.0385 0.9230 0.7988 0.0196 0.1154 3.6871 15.2189 38.7684 20.2310 233.4664 71.2092 0.0457 13.0590 771.6383 277.3073 193.8026 28.5236 32.9010 449.9323 103.8910 37.6209 32.9950 20.8873 38.4471 57.2164 15.3436 215.6032 24.9686 23.7378 138.3460 48.4002 9.4040 0.5461 21.4517 2.3077 1.5930 35.4021 4.8565 0.4805 1.3950 33.2217
temp: 298.150 k
press: 1.00000 atm
elementType: 8 8 7 7 7 7 6 6 6 6 6 6 6 6 6 6 6 6 1 1 1 1 1 1 1 1 1 1
symmnumber: 1
zpe: 537918.5 jmol-1
zpe.correction: 0.204882 hartree
zpe.thermalcorrener: 0.219750 hartree
zpe.thermalcorrenthalpy: 0.220694 hartree
zpe.thermalcorrgfe: 0.160338 hartree
zpe.sumelectzpe: -831.344622 hartree
zpe.sumelectthermal: -831.329754 hartree
zpe.sumelectthermalent: -831.328810 hartree
zpe.sumelectthermalfe: -831.389166 hartree
dipole: 8.5766 -1.7587 -0.0121
dipole: 8.7551
quadrupole: -124.9280 -93.4394 -108.0891
quadrupole: 6.2876 0.0094 0.0541
quadrupole: -16.1092 15.3795 0.7297 6.2876 0.0094 0.0541
hfenergy: -831.5495041 hartree
pointgroup: C01 [X(C12H10N4O2)]
dipole: -3.387791 0.5075056 -0.360589 debye
polarizability: 488.9228627|7.5611065|134.6885023|-6.998871|-52.8495838|100.353981 unknown
InChI: InChI=1S/C12H10N4O2/c17-16(18)12-8-6-11(7-9-12)14-15-13-10-4-2-1-3-5-10/h1-9,13H
charge 0 multiplicity 1
28 atoms
O  6.201159 0.340944 -0.259184
O  5.528455 -1.439099 1.003522
N  -2.310308 0.792653 -0.584096
N  -0.129951 1.05652 -0.782053
N  5.282515 -0.403227 0.267215
N  -1.08617 0.323536 -0.242316
C  1.185908 0.617359 -0.466361
C  3.872057 -0.050385 0.013439
C  -3.504628 0.186929 -0.13088
C  2.233281 1.403072 -1.025069
C  1.508672 -0.516552 0.340912
C  3.578047 1.075846 -0.789274
C  2.84886 -0.84959 0.580345
C  -4.738509 0.753112 -0.546394
C  -3.487457 -0.953214 0.71482
C  -5.951391 0.178196 -0.114908
C  -4.708871 -1.514575 1.136296
C  -5.94507 -0.957547 0.727787
H  1.96065 2.265675 -1.640371
H  0.700597 -1.117298 0.766789
H  4.397594 1.665263 -1.207736
H  3.127601 -1.710668 1.193557
H  -4.748034 1.63418 -1.200058
H  -2.530713 -1.378625 1.027217
H  -6.900696 0.618559 -0.437894
H  -4.696291 -2.394134 1.789121
H  -2.344325 1.624305 -1.196492
H  -6.888185 -1.402038 1.061463
