program: Gaussian 09
title: 000250379
version: EM64L-G09RevD.01
frameworkgroup: C1[X(C13H12N4O2)]
method: RPBEPBE
basis: SDD
operation: Freq
keyword: #p
keyword: freq=noraman
keyword: PBEPBE/SDD
title: #p freq=noraman PBEPBE/SDD
converged: YES YES NO NO
title: Mulliken charges:
elementType: O O N N N N C C C C C C C C C C C C C H H H H H H H H H H H H
charge: -0.223545 -0.221705 -0.399131 -0.153510 0.019287 -0.017470 0.441219 0.498983 0.160847 0.385918 -0.358602 -0.365176 -0.391945 -0.342828 -0.338530 -0.338140 -0.287457 -0.339014 -0.802274 0.236204 0.274888 0.233670 0.236022 0.287280 0.286566 0.258093 0.249187 0.228569 0.228830 0.240641 0.313121
chargesum: 0.00000
title: Mulliken charges with hydrogens summed into heavy atoms:
elementType: O O N N N N C C C C C C C C C C C C C
charge: -0.223545 -0.221705 -0.086010 -0.153510 0.019287 -0.017470 0.441219 0.498983 0.160847 0.385918 -0.124932 -0.129154 -0.155741 -0.067940 -0.051250 -0.051574 -0.029364 -0.089827 -0.104233
polarizability: 5.26503240e+02 -2.32132278e+00 1.84079622e+02 4.91288645e-01 1.91447585e-01 7.16394982e+01
1716.lowfreq: -10.8571 -6.6934 -1.3775 -0.0009 -0.0007 0.0004 5.4988 25.3244 33.3830
frequency: -9.9637 25.2343 33.3671 40.0035 72.6408 76.6078 134.5148 140.4967 199.5355 207.8335 229.3995 244.1813 304.2419 322.8019 372.1376 378.6204 410.2945 413.5685 417.2304 499.4690 505.3766 514.1942 528.2407 600.9121 629.1337 636.2927 655.7850 664.6918 709.5942 722.6410 733.3200 748.3624 783.5008 822.4374 830.8905 841.3362 846.9563 860.9009 914.6067 968.9955 981.2404 983.3770 987.8729 993.3503 997.9655 1004.9295 1045.0908 1096.8227 1103.8497 1119.4060 1138.1019 1168.5296 1174.4333 1214.7184 1223.1925 1225.3696 1267.8443 1298.7320 1304.8647 1350.5499 1361.1717 1372.4259 1398.6222 1402.6896 1420.8300 1438.3963 1469.9669 1472.6808 1473.3258 1492.1278 1514.6868 1574.8893 1590.3138 1612.9951 1617.1864 2975.0059 3056.4115 3088.1036 3126.5409 3132.0595 3137.8736 3162.4614 3167.0028 3176.1083 3185.7926 3195.8558 3392.2207
redmass: 1.0534 3.6784 5.8439 6.1504 5.6430 6.8929 5.6986 6.3167 7.5411 6.0749 4.6407 6.6164 5.6069 3.1682 4.5120 7.1925 3.9815 3.4786 3.0145 3.1035 7.7891 6.6591 2.6902 6.2871 6.9894 6.7673 7.5409 4.7112 1.3173 2.7631 4.7327 6.0206 6.8433 6.2401 1.3066 1.5072 1.2520 1.5862 4.5396 1.3367 1.3343 1.3691 1.4018 2.9406 1.3329 2.7566 1.5724 3.1954 1.8245 1.2769 2.4396 1.3652 1.4084 2.2164 3.7542 4.5931 1.9680 1.3791 1.3200 7.9636 8.7733 5.1755 1.2246 6.1044 3.7272 4.1745 1.1148 1.0717 1.9663 2.5759 2.9129 6.2177 6.7570 6.2617 6.4557 1.0394 1.0939 1.1000 1.0893 1.0889 1.0905 1.0954 1.0952 1.0889 1.0947 1.0966 1.0750
irintensity: 0.5300 0.3951 0.0237 1.2856 3.1164 0.0087 0.2649 4.8761 1.2206 5.4173 2.7700 0.6565 0.3969 7.0323 6.2547 9.9149 10.7241 5.2763 0.0086 20.1045 5.9101 2.9901 13.6978 19.8147 0.4246 3.7454 3.4212 19.7560 76.1647 15.5753 3.3940 22.5322 6.5541 1.6196 21.3152 41.2693 3.0617 79.7538 0.1745 5.4290 0.9769 0.3365 1.6373 2.1014 0.1217 6.9820 35.9578 21.3273 118.2588 25.0051 434.7253 16.6685 209.7514 71.2818 514.4996 262.4830 215.6215 24.4960 1.0196 74.7552 16.5088 1.7629 7.5040 80.1247 4.3740 15.6578 15.3215 12.9384 5.3631 67.2959 212.7606 1.1218 6.3324 436.2607 196.2000 36.8152 23.4612 16.4694 17.2004 28.2955 8.1660 16.4184 3.4294 0.7347 1.4704 2.0655 18.2613
temp: 298.150 k
press: 1.00000 atm
elementType: 8 8 7 7 7 7 6 6 6 6 6 6 6 6 6 6 6 6 6 1 1 1 1 1 1 1 1 1 1 1 1
symmnumber: 1
zpe: 608470.6 jmol-1
zpe.correction: 0.231754 hartree
zpe.thermalcorrener: 0.247640 hartree
zpe.thermalcorrenthalpy: 0.248584 hartree
zpe.thermalcorrgfe: 0.186177 hartree
zpe.sumelectzpe: -870.575648 hartree
zpe.sumelectthermal: -870.559762 hartree
zpe.sumelectthermalent: -870.558818 hartree
zpe.sumelectthermalfe: -870.621225 hartree
dipole: 7.8876 -2.1040 0.0884
dipole: 8.1638
quadrupole: -136.7809 -99.4369 -114.1237
quadrupole: 16.7573 0.3484 0.1477
quadrupole: -20.0004 17.3436 2.6568 16.7573 0.3484 0.1477
hfenergy: -870.8074018 hartree
pointgroup: C01 [X(C13H12N4O2)]
dipole: -3.089424 -0.6348082 0.6072996 debye
polarizability: 524.2631545|-11.5320795|153.001505|-29.6148648|-49.6841375|104.9577008 unknown
InChI: InChI=1S/C13H12N4O2/c1-10-2-4-11(5-3-10)14-16-15-12-6-8-13(9-7-12)17(18)19/h2-9,15H,1H3
charge 0 multiplicity 1
31 atoms
O  6.624691 -0.247828 -0.428005
O  5.780879 1.602045 -1.4711
N  0.393081 -1.126931 0.635301
N  -1.806645 -1.008833 0.752748
N  5.636905 0.504772 -0.797888
N  -0.733754 -0.414068 0.293492
C  -5.621374 0.765732 -0.025208
C  1.672269 -0.701011 0.26773
C  -3.036828 -0.353166 0.449173
C  4.274581 0.089367 -0.431969
C  -4.445996 1.391397 -0.529317
C  -5.472936 -0.429275 0.726187
C  2.790557 -1.496329 0.654585
C  1.874467 0.498269 -0.476413
C  4.090139 -1.103573 0.306172
C  3.174378 0.889915 -0.823834
C  -3.169332 0.849218 -0.303208
C  -4.200356 -0.98534 0.960698
C  -6.993654 1.347675 -0.306324
H  2.634439 -2.418505 1.22627
H  1.009837 1.098512 -0.766506
H  -4.54299 2.318798 -1.106883
H  -6.362664 -0.925969 1.130445
H  4.963051 -1.696352 0.590929
H  3.359663 1.80459 -1.393099
H  -2.273721 1.340541 -0.69547
H  -4.079107 -1.906413 1.540193
H  -7.709727 1.106953 0.49875
H  -6.954791 2.445675 -0.415439
H  -7.410556 0.940172 -1.248349
H  0.252997 -1.993037 1.17894
