program: Gaussian 09
title: 000254474
version: EM64L-G09RevD.01
frameworkgroup: C1[X(C16H16N2O5)]
method: RPBEPBE
basis: SDD
operation: Freq
keyword: #p
keyword: freq=noraman
keyword: PBEPBE/SDD
title: #p freq=noraman PBEPBE/SDD
converged: YES YES NO NO
title: Mulliken charges:
elementType: O O O O O N N C C C C C C C C C C C C C C C C H H H H H H H H H H H H H H H H
charge: -0.262330 -0.193891 -0.206665 -0.451568 -0.213504 -0.321398 -0.391326 0.283234 -0.545938 -0.487947 -0.458343 -0.436943 0.203908 0.073076 0.125308 0.162557 0.204325 -0.351317 -0.358803 -0.389816 -0.210474 -0.213663 0.178474 0.234711 0.268387 0.272996 0.233859 0.225384 0.221993 0.223901 0.220403 0.387586 0.269398 0.268339 0.283951 0.281916 0.237600 0.237577 0.395043
chargesum: 0.00000
title: Mulliken charges with hydrogens summed into heavy atoms:
elementType: O O O O O N N C C C C C C C C C C C C C C C C
charge: -0.262330 -0.193891 -0.206665 -0.056525 -0.213504 -0.321398 -0.003740 0.283234 -0.042839 0.018909 -0.010967 0.007360 0.203908 0.073076 0.125308 0.162557 0.204325 -0.081919 -0.090464 0.176051 0.027126 0.023914 0.178474
polarizability: 2.61389741e+02 -1.46890096e+01 1.84035862e+02 -2.10558814e+01 -1.77478997e+01 1.48178293e+02
1716.lowfreq: -15.0489 -7.1546 -2.7903 -0.0004 0.0007 0.0008 9.8916 26.3011 34.8567
frequency: 9.8798 25.7699 34.7237 41.8663 61.9181 77.5748 101.5204 124.6479 134.7600 137.8787 142.0703 178.4872 188.8793 224.6387 250.2586 255.5935 272.5349 277.2444 318.3904 346.7683 372.7575 402.5108 421.1282 453.7277 489.2013 514.8445 525.0145 543.3937 557.8996 573.8505 597.7824 623.6473 649.7797 657.6885 659.5614 690.2968 704.7542 715.8915 745.6760 787.3978 788.1699 793.3986 798.1687 818.9920 855.6095 859.9031 887.8801 906.4375 911.4557 952.9987 974.5995 977.2151 988.2428 1005.3878 1006.1524 1027.3678 1037.3861 1053.3398 1074.6630 1075.7072 1078.6923 1108.3516 1134.2293 1165.8846 1172.8104 1182.4009 1199.4783 1202.3550 1208.8972 1214.4419 1232.2078 1253.5740 1279.6283 1282.7654 1297.2157 1301.3207 1312.0932 1315.4015 1320.6985 1334.0059 1416.5904 1453.8588 1455.5551 1457.0297 1458.3298 1475.6742 1481.1852 1492.6550 1505.4749 1601.1711 1617.4948 1619.3068 1626.0543 1675.8357 1686.1984 2988.0175 2996.5291 3013.3187 3020.7356 3031.7255 3034.2706 3050.3698 3076.3227 3089.0347 3111.0940 3138.5056 3152.7935 3164.9417 3174.2693 3531.3409 3566.3037
redmass: 6.4192 6.6000 6.6357 6.4500 6.5086 4.8299 4.5112 2.7528 4.0630 3.5769 5.0949 6.7875 2.6254 3.5492 5.6181 7.4251 4.3603 4.4375 3.7595 10.6386 6.0159 3.9708 3.9201 4.8927 1.9401 5.2127 7.3460 3.9089 9.2489 2.3974 1.1742 4.3672 1.4898 4.7938 5.1186 7.4456 5.1923 3.0752 3.9162 3.8353 1.6463 2.4430 2.2236 2.1179 4.2112 5.3852 2.7098 1.3994 2.8179 2.4162 1.4124 2.0397 1.6709 2.5730 1.4137 2.5869 2.1877 2.7791 2.5961 2.4698 2.0404 4.6400 4.8663 1.2549 2.0292 1.3755 1.8583 1.5664 1.0949 2.3312 1.4758 1.3862 1.2977 1.5076 1.4723 1.9421 3.4826 1.8064 1.5106 1.5688 6.7130 2.4763 1.0868 1.9822 1.3242 1.6603 1.1796 1.1000 1.1013 9.0906 8.3708 7.9004 10.7252 12.6594 9.2291 1.0628 1.0620 1.0629 1.0668 1.0964 1.0652 1.0980 1.1008 1.1017 1.1035 1.0864 1.0906 1.0956 1.1003 1.0644 1.0777
irintensity: 0.5200 0.9296 3.0150 4.4678 5.0632 1.7362 1.1366 2.2591 0.2004 0.5407 0.5782 0.8340 1.0874 0.5075 4.2731 2.6765 1.4780 0.3507 8.4529 17.2625 7.8530 3.8018 8.8818 0.1046 39.1597 25.5162 10.4627 37.9916 0.6484 8.5137 31.2940 6.6684 186.1875 0.4637 12.0572 1.1002 13.5134 63.8435 8.5645 7.1974 10.8431 2.2407 26.5159 4.2662 9.6232 32.5599 14.0982 0.0964 26.7793 4.5737 1.9320 1.3630 0.4451 4.7177 0.3984 3.5944 31.1334 55.5613 10.6867 14.0011 196.7001 11.3645 16.2635 7.2674 3.2823 1.7241 9.3171 4.3360 2.3707 4.5986 5.2546 9.6711 2.2925 2.8923 15.9524 37.5858 225.0485 172.9122 58.0493 5.7357 12.7091 10.8009 7.7447 4.3524 5.9730 288.4471 58.3267 12.4517 22.2823 132.7111 147.1084 3.8175 303.2387 53.7102 280.1155 26.6273 28.6113 59.2968 8.1628 4.2568 6.6435 9.3294 32.1391 32.7029 18.2217 1.9764 6.4781 6.2077 23.2959 34.1163 59.0857
temp: 298.150 k
press: 1.00000 atm
elementType: 8 8 8 8 8 7 7 6 6 6 6 6 6 6 6 6 6 6 6 6 6 6 6 1 1 1 1 1 1 1 1 1 1 1 1 1 1 1 1
symmnumber: 1
zpe: 786208.1 jmol-1
zpe.correction: 0.299451 hartree
zpe.thermalcorrener: 0.320121 hartree
zpe.thermalcorrenthalpy: 0.321066 hartree
zpe.thermalcorrgfe: 0.247124 hartree
zpe.sumelectzpe: -1103.306967 hartree
zpe.sumelectthermal: -1103.286297 hartree
zpe.sumelectthermalent: -1103.285352 hartree
zpe.sumelectthermalfe: -1103.359294 hartree
dipole: 0.4975 0.9603 3.7421
dipole: 3.8952
quadrupole: -104.7238 -135.4532 -139.3209
quadrupole: -17.1170 -8.6591 0.2509
quadrupole: 21.7755 -8.9539 -12.8216 -17.1170 -8.6591 0.2509
hfenergy: -1103.606418 hartree
pointgroup: C01 [X(C16H16N2O5)]
dipole: 0.39085 1.3974725 0.4927854 debye
polarizability: 253.6921038|-38.893155|150.3143102|-5.4250466|-7.5270854|189.5974817 unknown
InChI: InChI=1S/C16H16N2O5/c19-12(20)9-17-15(23)16(7-3-4-8-16)18-13(21)10-5-1-2-6-11(10)14(18)22/h1-2,5-6,17,19H,3-4,7-9H2
charge 0 multiplicity 1
39 atoms
O  -1.043484 -1.516402 -0.473321
O  1.845953 0.011155 -2.607924
O  0.634225 0.500261 1.934778
O  -4.772139 0.861833 1.503759
O  -5.694514 -1.248703 1.833615
N  0.916392 0.468181 -0.43291
N  -2.566881 0.001721 0.371045
C  -0.481738 0.879139 -0.72035
C  -0.818732 2.262739 -0.072901
C  -0.773726 1.147963 -2.233157
C  -1.96469 2.883199 -0.936988
C  -2.077461 1.98141 -2.208945
C  -1.379532 -0.314146 -0.246962
C  1.916312 0.01287 -1.356309
C  1.337488 0.260848 0.920244
C  3.069008 -0.43941 -0.510651
C  2.72446 -0.286736 0.850644
C  4.316366 -0.950627 -0.89816
C  3.613206 -0.639081 1.877718
C  -3.466452 -1.062444 0.813444
C  5.224885 -1.310067 0.131121
C  4.878787 -1.15618 1.498335
C  -4.752726 -0.542324 1.426349
H  0.090267 2.885968 -0.151323
H  -1.04783 2.181077 1.002151
H  -0.843973 0.220557 -2.821965
H  0.055625 1.741591 -2.654473
H  -1.712061 3.92301 -1.208907
H  -2.92575 2.928499 -0.391019
H  -2.958944 1.318543 -2.136743
H  -2.19031 2.573363 -3.133516
H  -2.811189 0.961903 0.616082
H  4.568412 -1.06897 -1.95655
H  3.332023 -0.521013 2.928759
H  -2.972033 -1.71596 1.560311
H  -3.726412 -1.731987 -0.028607
H  6.207931 -1.715814 -0.131008
H  5.599985 -1.445118 2.27036
H  -5.621049 1.165049 1.923874
