program: Gaussian 09
title: 000254477
version: EM64L-G09RevD.01
frameworkgroup: C1[X(C17H22N2O5)]
method: RPBEPBE
basis: SDD
operation: Freq
keyword: #p
keyword: freq=noraman
keyword: PBEPBE/SDD
title: #p freq=noraman PBEPBE/SDD
converged: YES YES NO NO
title: Mulliken charges:
elementType: O O O O O N N C C C C C C C C C C C C C C C C C H H H H H H H H H H H H H H H H H H H H H H
charge: -0.257166 -0.253926 -0.291757 -0.285358 -0.314891 -0.459368 -0.363918 0.385913 -0.470982 -0.494763 -0.444283 -0.410172 0.126114 0.167776 -0.477073 -0.495688 0.312591 -0.477608 0.469922 -0.368162 -0.390895 -0.229068 -0.226159 -0.234627 0.232214 0.243000 0.224739 0.261916 0.214001 0.252741 0.220635 0.222882 0.350680 0.257123 0.258748 0.247076 0.239116 0.247800 0.366113 0.217810 0.241819 0.274556 0.232151 0.225919 0.225199 0.227308
chargesum: 0.00000
title: Mulliken charges with hydrogens summed into heavy atoms:
elementType: O O O O O N N C C C C C C C C C C C C C C C C C
charge: -0.257166 -0.253926 -0.291757 -0.285358 -0.314891 -0.108688 0.002195 0.385913 0.004232 -0.008109 0.022459 0.033345 0.126114 0.167776 0.038798 0.238304 0.312591 -0.017978 0.469922 -0.093606 -0.158743 -0.003149 -0.000959 -0.007319
polarizability: 2.57303859e+02 -1.41427700e+01 2.01741348e+02 -1.45576131e+01 -6.41030797e+00 1.67228755e+02
1716.lowfreq: -14.5941 -6.9834 -3.5834 -0.0009 -0.0008 -0.0004 5.8810 16.3422 24.7221
frequency: -7.3281 12.8638 24.7035 35.8897 47.3459 54.5621 69.0457 77.8205 90.8422 99.3404 111.9744 114.8302 131.7811 135.4184 162.7898 181.8949 205.9643 220.1030 234.1229 285.0050 291.0659 304.5555 311.6056 322.7384 370.0345 398.1498 403.8942 405.1502 455.3629 514.6346 534.4489 572.3974 589.7482 602.8475 617.3015 640.0317 649.5052 677.7068 683.7410 699.2480 705.7091 713.6957 720.1698 745.1760 760.3644 812.0881 815.3121 836.5343 857.3196 858.4958 876.5225 905.8374 910.7646 934.1883 946.9095 959.3128 962.0353 981.4522 987.6880 988.7376 992.6952 1000.0394 1005.3706 1026.6708 1048.2267 1059.0893 1062.8948 1090.4412 1094.5562 1115.4600 1142.4055 1150.8060 1159.7433 1168.0176 1172.4936 1188.4982 1207.6535 1208.2923 1218.7922 1220.1961 1235.0704 1239.1467 1240.9448 1273.5727 1298.8618 1309.9521 1317.5270 1323.6765 1329.6250 1337.0506 1351.9968 1385.1415 1424.8818 1441.6113 1453.7638 1453.9318 1455.5082 1458.6477 1462.7882 1465.1617 1469.1224 1475.5234 1479.0649 1484.3159 1503.1921 1594.0729 1605.1260 1614.7453 1620.9883 1653.5526 2967.9531 3005.9603 3008.9983 3010.6616 3015.5485 3020.7624 3025.6886 3031.9606 3065.4223 3079.2188 3090.5939 3100.2321 3105.6350 3115.7252 3119.2161 3126.5950 3139.1410 3150.1956 3157.4155 3163.5630 3443.1709 3493.0885
redmass: 5.1648 4.9391 4.2524 5.2329 5.0080 5.1750 5.4874 3.1339 3.2652 2.6632 1.7959 5.2035 3.2118 3.0357 4.1984 4.4025 4.9816 3.0783 4.8679 4.5514 2.7901 4.5664 3.3128 4.9782 2.4276 3.7436 2.8227 6.9072 3.7624 3.3854 2.1635 3.1735 4.4453 5.0487 6.3250 3.1867 4.3939 1.3767 1.1384 6.7974 2.0179 3.5362 3.3660 3.6714 2.1743 2.2418 3.4704 2.6472 2.2873 1.2653 3.8500 2.5813 2.4038 1.5326 5.7661 2.2091 2.4985 1.4998 2.8196 2.2386 4.1529 1.3459 1.9196 2.2104 2.2532 3.3818 1.7180 1.5248 2.4318 1.2617 3.3556 1.5292 2.6751 2.1739 1.0543 1.1197 1.8276 1.0985 1.7103 2.8862 1.3888 1.1731 1.5168 1.8695 1.3657 1.3554 1.4217 1.3090 1.2537 1.5809 1.3855 7.9188 1.1988 2.1727 1.0914 1.0533 1.0889 1.2852 1.0589 1.0898 1.8603 1.1084 1.1103 2.2145 2.1264 6.0770 8.8011 6.0663 6.6217 9.0402 1.0586 1.0587 1.1016 1.0294 1.0595 1.0606 1.0645 1.0586 1.1027 1.1036 1.1047 1.1052 1.1070 1.1050 1.0856 1.0877 1.0922 1.0964 1.1054 1.1016 1.0775 1.0773
irintensity: 0.2402 0.2455 0.1183 0.0904 0.3152 0.2861 0.2858 0.2423 2.7981 3.6162 1.6801 9.9278 12.1957 0.6908 0.8093 0.4063 2.8730 7.8425 32.0027 9.6177 4.5564 1.0542 13.8948 0.7991 24.2498 3.7625 0.0787 11.4575 14.8985 1.0212 3.8468 3.9882 16.9366 28.4243 0.7668 0.3195 5.6642 68.3309 79.2222 18.6378 69.5731 18.8212 21.2424 11.3133 60.8997 6.0690 9.4445 17.4638 13.0559 0.4458 37.0058 6.4568 2.4558 6.9969 32.2912 12.4745 77.3188 12.6793 65.6085 10.1977 94.4384 2.6037 1.4109 3.6968 13.5406 3.3259 5.9562 8.7356 42.2874 0.2106 333.3338 10.0074 79.3919 1.8463 0.1699 2.0228 55.7400 2.4905 30.4238 24.5240 0.9594 11.0487 4.4458 73.4327 3.2014 1.2333 28.9223 2.3414 4.3930 83.6947 15.7458 0.6132 23.0255 11.0444 21.8090 11.6294 30.4006 109.8157 16.9095 46.2909 680.9178 31.5262 138.4728 33.1363 142.1469 2.8508 273.9594 0.4186 23.8272 302.7217 43.7023 23.5612 13.8234 32.4719 41.5836 40.1823 11.0593 38.8787 15.6487 14.3817 10.0796 50.6671 7.2621 20.3057 3.9616 2.9873 22.0899 25.2076 11.6660 24.4616 123.3953 162.3919
temp: 298.150 k
press: 1.00000 atm
elementType: 8 8 8 8 8 7 7 6 6 6 6 6 6 6 6 6 6 6 6 6 6 6 6 6 1 1 1 1 1 1 1 1 1 1 1 1 1 1 1 1 1 1 1 1 1 1
symmnumber: 1
zpe: 975832.4 jmol-1
zpe.correction: 0.371675 hartree
zpe.thermalcorrener: 0.394788 hartree
zpe.thermalcorrenthalpy: 0.395732 hartree
zpe.thermalcorrgfe: 0.315926 hartree
zpe.sumelectzpe: -1144.861067 hartree
zpe.sumelectthermal: -1144.837955 hartree
zpe.sumelectthermalent: -1144.837010 hartree
zpe.sumelectthermalfe: -1144.916816 hartree
dipole: 5.0623 0.0270 1.3530
dipole: 5.2400
quadrupole: -102.6307 -146.1234 -135.9046
quadrupole: -11.5303 -1.0879 -3.7755
quadrupole: 25.5889 -17.9038 -7.6851 -11.5303 -1.0879 -3.7755
hfenergy: -1145.2327424 hartree
pointgroup: C01 [X(C17H22N2O5)]
dipole: -2.0047648 0.0353465 0.4793449 debye
polarizability: 257.0067292|-9.9272309|202.362275|18.9610401|0.089304|166.904957 unknown
InChI: InChI=1S/C17H22N2O5/c1-23-15(21)17(9-5-6-10-17)19-14(20)11-18-16(22)24-12-13-7-3-2-4-8-13/h2-4,7-8,18-19H,5-6,9-12H2,1H3
charge 0 multiplicity 1
46 atoms
O  -6.126467 0.489343 0.074003
O  -4.539702 2.078518 -0.514963
O  -1.197041 -1.551259 -0.25225
O  3.229977 -0.821442 -1.274628
O  2.528464 1.4266 -1.533869
N  -2.525966 0.363736 -0.417252
N  1.050578 -0.281342 -0.92366
C  -3.824634 -0.255297 -0.068654
C  -4.216893 -1.481636 -0.991381
C  -3.85097 -0.833074 1.401985
C  -4.283123 -2.717476 -0.05651
C  -4.689483 -2.128271 1.31641
C  -4.835717 0.895886 -0.205264
C  -1.333072 -0.305369 -0.480158
C  -0.124212 0.574603 -0.857643
C  -7.170599 1.544603 -0.002277
C  2.278685 0.218256 -1.260522
C  4.637805 -0.394231 -1.568126
C  5.3972 -0.048215 -0.304447
C  5.32443 1.260711 0.240503
C  6.19116 -1.024676 0.348442
C  6.030969 1.581823 1.420433
C  6.899541 -0.704222 1.528342
C  6.820689 0.601315 2.066674
H  -5.203308 -1.295016 -1.450393
H  -3.475825 -1.599297 -1.798129
H  -4.237209 -0.100498 2.131821
H  -2.810565 -1.080092 1.673797
H  -4.994006 -3.478625 -0.423705
H  -3.280549 -3.173602 0.014684
H  -4.47562 -2.811954 2.15712
H  -5.768768 -1.889304 1.329868
H  -2.569856 1.369602 -0.627849
H  -0.305126 1.078167 -1.828487
H  0.009247 1.378704 -0.105754
H  -6.947293 2.350666 0.715898
H  -8.105164 1.027736 0.254166
H  -7.210196 1.963753 -1.021116
H  0.911459 -1.273393 -0.701123
H  5.064376 -1.276123 -2.07197
H  4.592481 0.463969 -2.260926
H  4.7009 2.009869 -0.260503
H  6.250957 -2.03814 -0.067503
H  5.969344 2.594743 1.83418
H  7.511485 -1.466203 2.02415
H  7.371119 0.852655 2.980584
