program: Gaussian 09
title: 000250377
version: EM64L-G09RevD.01
frameworkgroup: C1[X(C13H17Cl2N2O2P)]
method: RPBEPBE
basis: SDD
operation: Freq
keyword: #p
keyword: freq=noraman
keyword: PBEPBE/SDD
title: #p freq=noraman PBEPBE/SDD
converged: NO YES NO NO
title: Mulliken charges:
elementType: Cl Cl P O O N N C C C C C C C C C C C C C H H H H H H H H H H H H H H H H H
charge: -0.049460 -0.054790 1.309298 -0.486150 -0.565419 -0.678611 -0.494465 0.200087 -0.354919 -0.417421 0.431184 -0.527063 0.209595 -0.297662 -0.317582 -0.433192 -0.376124 -0.210877 -0.566788 -0.555244 0.250555 0.223686 0.219363 0.222013 0.227814 0.233558 0.247164 0.273661 0.234532 0.281918 0.234936 0.253509 0.229104 0.267393 0.279732 0.260155 0.296510
chargesum: 0.00000
title: Mulliken charges with hydrogens summed into heavy atoms:
elementType: Cl Cl P O O N N C C C C C C C C C C C C C
charge: -0.049460 -0.054790 1.309298 -0.486150 -0.565419 -0.678611 -0.494465 0.200087 0.119323 0.023955 0.431184 -0.065691 0.209595 0.223163 0.198868 -0.198256 -0.122615 0.018227 -0.019662 0.001420
polarizability: 2.55880827e+02 9.42729912e+00 1.65325637e+02 -1.94337354e+01 1.02068533e+01 1.76381096e+02
1716.lowfreq: -6.1909 -5.2106 -0.0023 -0.0016 -0.0003 6.7674 19.2603 28.6984 32.5151
frequency: 18.7898 28.6541 32.4795 41.1473 70.0488 84.7922 90.0127 90.9816 111.8101 166.2856 174.3826 192.8113 207.6164 216.1672 219.6548 254.4014 271.1663 294.8724 315.0947 324.5138 357.2599 400.4600 429.7873 439.8598 466.1339 487.8292 506.7871 527.2929 555.7041 574.4840 590.5250 651.4926 664.1347 695.1015 705.9880 730.2046 754.7619 770.4002 773.2389 775.8490 835.6424 855.8254 874.4525 892.4625 919.1072 955.3790 957.0514 999.3761 1010.4434 1031.7893 1039.1924 1044.9692 1052.1446 1059.1074 1064.3383 1076.1725 1115.7067 1119.5279 1169.5201 1188.0018 1194.0162 1207.8860 1220.7257 1232.5453 1242.3419 1254.9119 1258.6565 1271.5562 1291.8014 1294.2190 1330.6481 1331.2889 1347.5642 1354.7172 1361.3470 1365.7470 1399.3933 1447.5588 1450.1179 1452.0166 1458.4889 1459.7902 1465.9614 1476.2883 1477.7147 1485.4852 1603.9191 1623.4182 2973.6059 2975.3615 2999.0227 3013.6267 3022.0382 3040.1424 3047.8406 3059.9436 3061.9145 3067.4313 3078.3183 3092.7420 3128.4910 3148.6573 3149.2895 3154.3929 3180.3215
redmass: 7.9107 8.5407 13.5482 6.5413 4.7734 3.0165 2.3260 3.5004 2.9109 4.8880 5.2003 4.8575 4.8410 4.7971 9.4768 5.0385 5.5890 2.0512 3.7099 3.6993 6.6342 5.3194 4.4730 6.6069 3.6923 5.5006 4.7219 5.4278 4.0222 7.7187 3.7194 5.7438 6.8364 5.4259 4.4776 3.1098 3.6826 1.6579 1.1786 1.2116 2.9452 1.7120 2.5321 1.4144 2.8072 1.4058 2.3819 1.4648 3.2144 2.5955 2.1934 5.1633 3.2750 2.8893 2.1527 1.8288 1.6313 2.6057 1.2310 1.3961 1.4291 2.3778 2.6432 1.5938 1.6427 1.1600 1.1629 1.2714 1.1657 2.7346 1.3924 1.2542 1.3961 1.2305 1.4742 1.2503 5.4527 1.0868 1.7139 1.0925 1.3393 1.2135 1.1610 1.7175 1.1192 1.5001 8.2015 7.9554 1.0641 1.0645 1.0623 1.0614 1.0618 1.0962 1.0980 1.0567 1.0567 1.1032 1.1030 1.1034 1.0881 1.1122 1.1121 1.0926 1.0970
irintensity: 0.3369 0.3679 0.1845 0.9138 1.7040 2.2697 1.8837 5.5480 1.2801 1.9231 1.5628 2.6246 2.2934 1.8762 6.7239 0.8261 24.2235 4.4531 14.4807 7.3898 2.0395 9.7226 29.1220 25.6790 10.7226 3.4638 10.9884 28.8993 2.3150 2.6946 13.5353 42.5095 25.0942 87.8609 80.6273 15.4911 185.8809 39.8802 1.0454 18.8359 85.1833 3.9385 8.8667 0.1255 4.3425 13.3380 135.5986 1.8910 33.3211 10.2799 26.0066 24.2072 21.7946 120.8616 42.5133 19.9120 67.0965 54.4538 1.9140 50.1017 6.8792 78.3655 28.8067 7.7284 6.9452 15.0381 8.7581 4.0303 7.8899 88.6036 17.6400 19.9554 3.4774 1.4488 7.2017 0.2924 14.4144 11.3362 59.3759 1.9909 27.8861 64.5904 21.2547 13.6318 11.9682 87.2310 9.5799 11.1475 16.6781 53.2141 20.9716 11.0945 12.3107 23.1645 31.4191 10.7358 15.5092 51.3880 4.2704 0.8884 7.7298 8.1728 14.5189 17.7447 7.9729
temp: 298.150 k
press: 1.00000 atm
elementType: 17 17 15 8 8 7 7 6 6 6 6 6 6 6 6 6 6 6 6 6 1 1 1 1 1 1 1 1 1 1 1 1 1 1 1 1 1
symmnumber: 1
zpe: 752908.4 jmol-1
zpe.correction: 0.286768 hartree
zpe.thermalcorrener: 0.307046 hartree
zpe.thermalcorrenthalpy: 0.307990 hartree
zpe.thermalcorrgfe: 0.234920 hartree
zpe.sumelectzpe: -2025.373306 hartree
zpe.sumelectthermal: -2025.353027 hartree
zpe.sumelectthermalent: -2025.352083 hartree
zpe.sumelectthermalfe: -2025.425153 hartree
dipole: 3.9070 2.8579 1.2597
dipole: 5.0020
quadrupole: -141.5998 -158.4389 -133.9020
quadrupole: -5.4834 5.6499 12.0268
quadrupole: 3.0471 -13.7920 10.7449 -5.4834 5.6499 12.0268
hfenergy: -2025.6600732 hartree
pointgroup: C01 [X(C13H17Cl2N2O2P1)]
dipole: -1.401761 -1.3710366 -0.1674489 debye
polarizability: 249.811396|8.8378736|175.9747965|30.7613224|-7.8101337|171.8013678 unknown
InChI: InChI=1S/C13H17Cl2N2O2P/c14-6-9-16(10-7-15)20(18)17-8-2-4-11-3-1-5-12(19-20)13(11)17/h1,3,5H,2,4,6-10H2
charge 0 multiplicity 1
37 atoms
Cl 1.620783 -3.169167 -2.583459
Cl 5.847515 1.366045 0.830812
P  0.698871 0.710318 0.934009
O  0.057666 1.778009 -0.373931
O  1.13536 1.371204 2.313045
N  -0.732975 -0.308921 0.837902
N  2.027206 -0.13318 0.208745
C  -1.725198 0.256922 -0.001729
C  -1.120568 -1.371355 1.7889
C  -2.173928 -2.282867 1.110786
C  -3.027138 -0.254171 -0.164103
C  -3.420897 -1.48662 0.64021
C  -1.284964 1.419996 -0.67973
C  1.87174 -0.807625 -1.099615
C  3.387374 0.039375 0.774987
C  -3.877464 0.439226 -1.062034
C  -2.126665 2.115315 -1.554586
C  -3.43713 1.599614 -1.742995
C  1.701611 -2.321556 -0.897486
C  4.058735 1.310674 0.227962
H  -1.536911 -0.928101 2.715856
H  -0.223133 -1.954321 2.065574
H  -2.47499 -3.06674 1.829572
H  -1.707436 -2.787726 0.243204
H  -4.013298 -1.178225 1.525717
H  -4.07743 -2.142832 0.039437
H  2.761896 -0.610214 -1.724781
H  1.001545 -0.398386 -1.641645
H  3.988421 -0.850915 0.515714
H  3.32071 0.103289 1.873873
H  -4.896399 0.069667 -1.227372
H  -1.781287 3.017545 -2.066123
H  -4.117639 2.116254 -2.427498
H  2.556534 -2.774655 -0.37391
H  0.756653 -2.56256 -0.390087
H  4.111609 1.325807 -0.871085
H  3.579222 2.222478 0.612571
