program: Gaussian 09
title: 000250376
version: EM64L-G09RevD.01
frameworkgroup: C1[X(C8H9N5OS)]
method: RPBEPBE
basis: SDD
operation: Freq
keyword: #p
keyword: freq=noraman
keyword: PBEPBE/SDD
title: #p freq=noraman PBEPBE/SDD
converged: YES YES NO NO
title: Mulliken charges:
elementType: S O N N N N N C C C C C C C C H H H H H H H H H
charge: 0.184686 -0.235585 -0.210336 -0.000922 0.027099 -0.056842 -0.630383 0.154148 -0.110375 0.178441 -0.171076 -0.066769 -0.576205 -0.373977 -0.618356 0.280216 0.291658 0.260465 0.249167 0.381267 0.332720 0.231546 0.251323 0.228091
chargesum: 0.00000
title: Mulliken charges with hydrogens summed into heavy atoms:
elementType: S O N N N N N C C C C C C C C
charge: 0.184686 -0.235585 -0.210336 -0.000922 0.027099 -0.056842 0.083604 0.154148 -0.110375 0.178441 0.109139 -0.066769 -0.024082 -0.124809 0.092603
polarizability: 2.25837285e+02 -1.51545208e+00 1.50296826e+02 5.60280125e+00 -2.30418581e+00 6.76290053e+01
1716.lowfreq: -9.9249 -6.1963 -0.0015 -0.0011 -0.0010 2.9882 21.6281 39.9834 59.3229
frequency: 20.9994 39.9289 59.3079 88.6381 128.0875 180.3550 202.9300 218.9890 236.2160 273.8940 297.1864 313.3921 336.7839 445.3570 512.2578 517.4380 547.3695 550.9617 554.6666 584.1210 600.5255 624.2578 635.5778 679.7502 691.9023 736.8537 757.7774 788.4861 828.9892 833.8362 849.4613 940.3307 970.5716 981.0284 1027.3344 1062.5346 1071.5339 1125.4579 1175.3812 1239.3842 1249.1476 1254.4280 1282.1506 1291.7452 1314.1461 1330.8243 1362.8029 1395.0433 1427.9473 1431.3547 1464.1429 1466.1509 1478.5559 1519.1168 1549.1516 1608.8566 1629.5686 2989.1494 3041.8527 3082.5591 3098.7698 3126.1035 3166.7150 3236.1987 3440.5792 3644.0845
redmass: 4.8579 4.1656 3.9035 7.7669 2.6445 7.5553 1.9455 5.2653 4.2069 2.1961 6.7917 4.7978 3.5564 6.7582 6.8486 8.2105 1.6805 6.9482 3.9023 2.3445 5.5054 6.8991 5.4746 8.1063 8.2436 1.1020 1.1889 5.7641 9.3020 1.6914 9.1688 1.4369 2.7867 1.7700 7.4609 1.3528 2.2460 4.2515 3.8399 2.4357 3.8839 1.1884 1.2756 3.8046 4.9913 2.9686 2.3012 1.2041 2.2072 1.1544 1.3911 2.3822 1.0462 6.8601 2.2441 5.7943 2.6427 1.0372 1.0595 1.0961 1.1020 1.1063 1.0922 1.0988 1.0519 1.0994
irintensity: 0.0296 0.0463 0.1057 2.0432 0.2373 2.0010 9.2335 0.7541 2.9757 16.4348 7.5367 0.9652 3.4306 3.7723 5.7521 12.4741 54.6342 10.6919 0.1334 80.6256 9.9127 8.0150 24.8175 0.7612 14.6893 139.9960 4.8355 2.5818 147.0358 23.4224 144.6812 11.4442 13.8960 28.5393 58.0908 0.0784 9.3338 31.5478 98.5115 378.1104 2.6394 0.1561 0.5919 63.0014 30.7040 231.9899 6.3094 20.1325 12.2406 39.2758 41.8360 124.0053 8.3080 86.7805 18.3912 286.8350 375.2290 23.5084 12.0493 25.0256 8.0628 11.3294 21.3291 3.2128 171.1986 128.5709
temp: 298.150 k
press: 1.00000 atm
elementType: 16 8 7 7 7 7 7 6 6 6 6 6 6 6 6 1 1 1 1 1 1 1 1 1
symmnumber: 1
zpe: 458235.5 jmol-1
zpe.correction: 0.174533 hartree
zpe.thermalcorrener: 0.188213 hartree
zpe.thermalcorrenthalpy: 0.189157 hartree
zpe.thermalcorrgfe: 0.132322 hartree
zpe.sumelectzpe: -1056.220678 hartree
zpe.sumelectthermal: -1056.206998 hartree
zpe.sumelectthermalent: -1056.206054 hartree
zpe.sumelectthermalfe: -1056.262889 hartree
dipole: -6.8190 3.1890 -0.3344
dipole: 7.5353
quadrupole: -92.9262 -98.8939 -95.9042
quadrupole: 8.2377 -1.0200 0.5538
quadrupole: 2.9819 -2.9858 0.0039 8.2377 -1.0200 0.5538
hfenergy: -1056.3952111 hartree
pointgroup: C01 [X(C8H9N5O1S1)]
dipole: 2.7527773 -1.0961693 -0.0977106 debye
dipolederiv: -0.8854433 -0.0952951 0.0320111 -0.4168869 -0.1922268 0.1114666 0.2029663 0.0484524 -0.1623694 -0.8723317 -0.0011112 0.071348 0.0090537 -1.0381634 0.1291133 0.0913795 0.1439339 -0.3088951 -1.876006 0.2432387 0.2087273 0.8143821 -0.5713576 -0.0156123 0.1755241 0.0469008 0.002761 -0.9746431 0.1040015 0.0710696 -0.2688544 -0.2101189 0.0293894 0.1304937 -0.0196116 -0.2644863 -0.954984 -0.0710879 0.1086916 -0.3960179 -0.5609126 0.0998216 0.1634031 0.0591216 -0.2274425 -0.5697117 0.4281976 -0.0118178 -0.1111895 -0.6112293 0.0623327 0.0585874 -0.0057494 -0.2483018 -0.5157781 0.5029594 -0.0799225 0.3176158 -1.100365 0.0088268 -0.0543071 -0.021742 -0.6428201 0.4091093 0.0770975 -0.0531599 0.4342929 -0.645845 0.0381684 -0.1247168 0.0859431 0.057381 0.9211175 0.0682011 -0.1210044 0.5722807 0.3494854 -0.1094197 -0.1945916 -0.0476003 0.1158566 0.4838098 -0.5928439 0.0372764 -0.4179239 1.3505058 -0.0882877 0.019629 -0.0750408 0.2234128 0.6301158 -0.4096928 -0.0234026 -0.7902971 0.471252 0.0372402 0.0418325 -0.012456 -0.0273486 2.5963045 -0.0314879 -0.3156336 0.0015982 1.0513048 -0.1389678 -0.4329873 -0.162245 0.2395509 0.5815592 -0.1332742 0.0772302 -0.2967701 0.1099334 -0.0523194 0.066719 -0.0599834 0.1639941 0.6037835 -0.090539 -0.0763889 0.3352154 0.6800985 -0.1414721 -0.1348551 -0.0867996 -0.0147297 -0.1351441 0.0255183 -0.0544911 0.1512066 0.0253143 0.0366449 0.0147717 0.0313314 -0.0744044 0.0506084 -0.0415427 0.0254566 -0.0528432 0.1421142 0.0034859 0.0187356 0.0115753 0.163083 0.0191878 -0.0256684 -0.0587133 0.0544944 -0.0238119 -0.0710418 -0.0843672 -0.0173089 0.0394411 -0.0612948 -0.0077971 0.0663577 0.0068715 0.0704364 0.0817812 0.0332979 0.0556261 -0.0073591 -0.0876251 -0.0271948 0.0328662 -0.0336774 0.0897652 0.0096709 0.0334736 0.008802 0.12187 0.4456116 0.0810991 -0.0229723 0.114819 0.3074781 -0.0065947 -0.0217618 0.0053806 0.3613887 0.1471577 -0.0202287 0.0319627 -0.0108834 0.2841534 0.0151704 0.0289933 0.0191656 0.3625898 0.1110947 -0.0359407 -0.0365159 -0.1059027 -0.0736306 -0.0906682 -0.0268204 -0.0386804 0.0404184 0.0254826 -0.0714447 0.1110263 -0.0702697 0.0714436 0.0481853 0.0790068 0.0254746 0.0168065 -0.0919806 0.1248359 -0.0200015 0.1596861 0.0243758 0.0030859 -0.0844062 0.0055101 0.0696033 unknown
polarizability: 224.2020782|0.8377854|147.8771879|-16.6358702|-14.4148383|71.6838508 unknown
InChI: InChI=1S/C8H9N5OS/c1-2-15-8(14)13-4-12-7-5(13)6(9)10-3-11-7/h3-4H,2,9H2,1H3
charge 0 multiplicity 1
24 atoms
S  3.014307 1.093729 -0.824168
O  1.842111 -1.28075 -0.14683
N  0.384408 0.558127 -0.24832
N  -1.175734 2.256973 -0.261518
N  -3.168119 0.873203 0.206307
N  -2.727721 -1.523216 0.478554
N  -0.611207 -2.511613 0.322915
C  -0.884183 -0.054701 0.019707
C  -1.828254 1.01778 0.001178
C  -1.371152 -1.377852 0.271072
C  0.104434 1.954063 -0.401426
C  1.652412 -0.054286 -0.349876
C  4.462567 -0.133368 -0.684793
C  -3.530507 -0.422284 0.435597
C  4.96654 -0.287587 0.753815
H  0.897232 2.670662 -0.604768
H  4.091913 -1.085157 -1.097127
H  5.221581 0.292003 -1.36217
H  -4.595436 -0.605146 0.607106
H  0.403672 -2.457124 0.193963
H  -1.095232 -3.387413 0.513141
H  5.292345 0.677606 1.177883
H  4.182857 -0.713011 1.402826
H  5.831468 -0.97784 0.768832
