program: Gaussian 09
title: 000250375
version: EM64L-G09RevD.01
frameworkgroup: C1[X(C10H15N3O)]
method: RPBEPBE
basis: SDD
operation: Freq
keyword: #p
keyword: freq=noraman
keyword: PBEPBE/SDD
title: #p freq=noraman PBEPBE/SDD
converged: YES YES NO NO
title: Mulliken charges:
elementType: O N N N C C C C C C C C C C H H H H H H H H H H H H H H H
charge: -0.291647 -0.353698 -0.068180 -0.641145 -0.416718 -0.343360 -0.338294 -0.686474 0.148676 -0.290350 0.273070 -0.280085 -0.461848 0.155612 0.206837 0.208027 0.215564 0.215413 0.197634 0.197864 0.318875 0.211412 0.220924 0.211421 0.242476 0.281115 0.215922 0.316723 0.334233
chargesum: 0.00000
title: Mulliken charges with hydrogens summed into heavy atoms:
elementType: O N N N C C C C C C C C C C
charge: -0.291647 -0.034823 -0.068180 0.009811 -0.001854 0.087618 0.057204 -0.042717 0.148676 -0.047873 0.273070 0.001030 -0.245925 0.155612
polarizability: 2.30201833e+02 -1.87331925e+00 1.26414042e+02 -7.82042306e-01 -2.87211562e-01 7.28541342e+01
1716.lowfreq: -4.5553 -0.0006 -0.0004 -0.0001 5.4850 7.4255 23.5257 30.5248 54.7464
frequency: 23.4961 30.1905 54.6571 61.0599 85.0921 117.3367 155.1924 164.3866 210.0144 233.4840 263.2247 269.3452 370.7529 402.7388 405.7341 451.3210 458.3435 486.6231 532.5178 537.9001 577.1875 580.5208 637.1594 708.8214 717.0553 737.1510 776.3625 803.2251 838.5233 841.1756 908.8765 912.8137 943.6361 983.5011 999.1404 1024.3965 1043.6143 1080.2181 1092.3904 1114.3362 1146.7707 1149.4616 1152.8270 1221.3630 1242.5761 1282.7106 1285.9534 1294.0334 1320.5444 1345.2398 1351.8389 1366.5698 1373.7797 1392.8455 1400.8296 1443.8353 1469.1638 1474.2366 1479.0288 1486.2650 1497.8666 1521.8878 1548.4036 1581.2225 1610.6055 1629.1565 2936.2197 2964.3743 2974.2531 2975.2780 2976.0500 3008.6705 3038.3084 3072.7664 3077.3433 3099.8000 3151.7765 3172.3351 3530.3365 3543.8567 3684.4719
redmass: 3.9039 3.2423 2.1521 3.9427 3.8006 2.1815 3.1276 4.1042 4.3058 1.1200 4.7682 5.0075 3.7711 3.9168 2.9888 1.5009 3.3537 1.3532 2.7638 1.7247 1.3483 4.4415 7.5513 4.5109 4.8540 1.0746 5.4675 1.1572 4.3015 1.6010 1.7964 1.5259 1.1620 3.7870 1.3398 3.6369 1.9663 2.3438 2.8809 1.9529 3.0808 1.6678 1.5607 1.3038 1.6686 1.1622 1.4823 1.0597 1.3983 1.5056 2.6183 1.8966 4.7297 1.2677 2.8185 1.8719 1.0705 1.0697 1.0421 1.0719 1.1004 2.9623 5.5553 2.5389 6.6338 1.7724 1.0572 1.0587 1.0612 1.1002 1.0366 1.1009 1.1045 1.1010 1.0993 1.0902 1.0885 1.0971 1.0447 1.0764 1.1040
irintensity: 1.3792 15.1581 0.4293 0.5714 0.1452 0.3569 2.6824 3.9101 3.5480 0.0821 7.1111 0.0270 1.2755 4.7887 8.7106 13.8860 3.0544 245.7009 4.2249 7.5461 108.9551 23.4537 6.5492 31.4761 0.0661 10.2907 27.5349 0.0956 3.3189 27.3488 8.5673 10.8369 0.2912 5.2521 1.5142 0.1622 6.0042 1.1177 0.5908 0.1487 6.8134 60.2203 1.2024 0.0995 3.0515 0.4068 0.8727 0.1650 14.2364 1.3371 312.3333 17.8388 154.1281 8.0869 193.5063 28.6952 3.2064 1.0861 13.4941 21.7447 61.4743 191.3406 15.6039 220.6609 525.1199 258.0044 44.2039 3.1872 64.9613 22.8063 43.5526 0.8902 51.0087 81.7394 47.7913 42.2717 2.4354 13.7200 43.8865 60.1846 29.8379
temp: 298.150 k
press: 1.00000 atm
elementType: 8 7 7 7 6 6 6 6 6 6 6 6 6 6 1 1 1 1 1 1 1 1 1 1 1 1 1 1 1
symmnumber: 1
zpe: 633472.7 jmol-1
zpe.correction: 0.241277 hartree
zpe.thermalcorrener: 0.256020 hartree
zpe.thermalcorrenthalpy: 0.256964 hartree
zpe.thermalcorrgfe: 0.197462 hartree
zpe.sumelectzpe: -628.508075 hartree
zpe.sumelectthermal: -628.493332 hartree
zpe.sumelectthermalent: -628.492388 hartree
zpe.sumelectthermalfe: -628.551890 hartree
dipole: 4.0836 -2.1535 0.4113
dipole: 4.6349
quadrupole: -75.3790 -84.7583 -87.2094
quadrupole: 18.9677 -1.9871 -0.1416
quadrupole: 7.0700 -2.3094 -4.7605 18.9677 -1.9871 -0.1416
hfenergy: -628.7493519 hartree
pointgroup: C01 [X(C10H15N3O1)]
dipole: 1.612195 -0.8276153 0.2026024 debye
polarizability: 230.228419|-1.0158787|126.3038295|0.3984445|-2.1731386|72.9377614 unknown
InChI: InChI=1S/C10H15N3O/c1-2-3-6-12-9-5-4-8(7-13-9)10(11)14/h4-5,7,12H,2-3,6,11H2,1H3
charge 0 multiplicity 1
29 atoms
O  -4.509304 1.440419 -0.167133
N  1.577137 -0.637095 -0.012613
N  -0.597021 -1.466967 -0.02962
N  -4.865906 -0.829941 0.097222
C  4.02887 -0.308662 0.027554
C  2.645154 0.368928 -0.01074
C  5.188213 0.71216 0.025023
C  6.574726 0.035138 0.065255
C  0.228204 -0.361585 -0.028129
C  -0.292769 0.973035 -0.044011
C  -2.550949 0.019134 -0.037227
C  -1.681382 1.146203 -0.049743
C  -1.936931 -1.261153 -0.034721
C  -4.026823 0.268922 -0.042925
H  4.130464 -0.982297 -0.848098
H  4.099743 -0.944211 0.933939
H  2.571792 1.008748 -0.916328
H  2.537234 1.038916 0.86891
H  5.08196 1.390103 0.896044
H  5.113454 1.349623 -0.879153
H  1.820878 -1.62989 -0.00914
H  6.721084 -0.624433 -0.810609
H  7.387045 0.784235 0.062522
H  6.689236 -0.583452 0.975095
H  0.377922 1.83607 -0.052996
H  -2.135257 2.142525 -0.065773
H  -2.531213 -2.184744 -0.052499
H  -4.52985 -1.777919 0.248196
H  -5.869812 -0.65611 0.084197
