program: Gaussian 09
title: 000250372
version: EM64L-G09RevD.01
frameworkgroup: C1[X(C21H18N6O2)]
method: RPBEPBE
basis: SDD
operation: Freq
keyword: #p
keyword: freq=noraman
keyword: PBEPBE/SDD
title: #p freq=noraman PBEPBE/SDD
converged: YES YES NO NO
title: Mulliken charges:
elementType: O O N N N N N N C C C C C C C C C C C C C C C C C C C C C H H H H H H H H H H H H H H H H H H
charge: -0.294331 -0.276023 -0.353216 -0.354135 -0.051124 -0.041757 -0.012318 -0.006058 -0.340930 -0.383243 -0.382941 0.175279 0.132124 0.081653 0.072789 0.087333 0.064228 0.076456 0.065810 -0.392411 -0.388186 -0.339734 -0.298335 -0.313648 -0.314089 -0.212483 -0.227695 -0.215243 -0.216915 0.203727 0.241867 0.234472 0.221060 0.222699 0.243071 0.336376 0.377187 0.284406 0.287094 0.262019 0.261304 0.264279 0.263359 0.239703 0.240599 0.239475 0.236443
chargesum: 0.00000
title: Mulliken charges with hydrogens summed into heavy atoms:
elementType: O O N N N N N N C C C C C C C C C C C C C C C C C C C C C
charge: -0.294331 -0.276023 -0.016840 0.023052 -0.051124 -0.041757 -0.012318 -0.006058 0.104665 0.072290 0.082830 0.175279 0.132124 0.081653 0.072789 0.087333 0.064228 0.076456 0.065810 -0.108005 -0.101092 -0.077715 -0.037031 -0.049368 -0.050729 0.027220 0.012903 0.024232 0.019528
polarizability: 3.64343222e+02 -6.85587309e+01 2.32127745e+02 7.49379967e+00 -6.73974147e+00 2.36791097e+02
1716.lowfreq: -3.5949 -0.0004 0.0004 0.0008 6.4407 11.1292 11.5663 20.9627 33.3644
frequency: 11.4518 20.3617 33.3037 42.8701 46.2593 62.0010 85.9007 89.9812 95.4726 105.7683 128.3932 159.6811 179.2065 183.2408 225.7968 244.2390 266.4284 272.9470 289.1855 297.5013 335.7204 344.3264 365.4003 407.8323 412.0253 420.2351 467.5186 489.8986 490.7457 493.2323 496.4317 507.1173 511.6444 528.3154 529.8587 584.1150 586.5261 607.8872 608.7567 633.1482 635.7611 715.5086 738.2555 739.4072 742.4048 746.0727 757.7754 762.9663 767.4341 777.9240 781.2178 801.0519 807.7101 808.6410 865.6581 875.0413 887.5890 889.7467 909.8530 934.1481 944.4652 948.8827 950.6534 960.3400 973.6677 974.9596 976.4694 1000.4802 1002.6511 1010.3425 1011.6601 1049.2371 1078.7690 1111.5868 1112.6896 1115.8691 1151.1147 1153.0474 1168.7462 1175.0908 1193.1905 1193.8364 1214.5322 1241.8471 1245.7634 1262.5179 1273.2701 1274.2924 1275.5536 1284.0430 1310.5725 1325.5052 1326.4405 1350.3672 1365.6876 1370.7288 1373.0151 1377.2641 1411.9015 1413.9167 1446.8692 1450.4052 1454.8016 1455.3739 1456.3551 1477.8887 1479.5612 1494.0556 1511.8681 1517.3480 1518.0740 1551.4347 1551.6875 1595.4421 1601.2324 1616.9223 1617.7404 2984.4703 2999.9432 3011.3348 3051.1558 3063.9312 3079.3815 3138.5668 3139.2459 3152.1044 3153.5508 3162.5259 3166.2783 3166.7279 3168.4520 3176.3990 3178.0729 3471.0272 3475.8461
redmass: 6.9747 6.0289 7.1451 5.6630 5.1932 7.2050 5.2145 6.4623 8.0299 4.8708 3.6410 3.9130 4.3670 4.3553 5.3555 5.8204 6.0027 4.2094 5.6563 4.4375 3.8479 6.5230 2.8575 4.6263 4.5001 4.3648 2.7619 4.4123 4.2022 3.9963 4.3671 5.0354 2.8360 6.0417 6.2958 7.3392 7.4250 9.3187 9.5196 4.3296 4.5353 1.1276 3.6051 3.0274 4.0531 4.0673 3.6301 2.0099 1.7625 1.5114 1.5256 2.9676 3.1288 3.0981 4.1226 5.6683 1.7379 1.7258 2.9863 3.2612 3.0894 1.4508 1.4358 4.3970 3.3866 1.3700 1.4045 1.3353 1.3348 2.1041 2.0871 3.4842 2.8825 1.8049 1.8218 2.3890 1.5052 1.3880 1.8009 1.9039 1.7754 1.7304 1.4763 2.1712 2.1107 1.4791 2.9054 2.5122 2.0839 1.8799 1.2891 2.8056 2.4909 1.3882 1.2393 2.4578 2.5666 1.2845 5.2251 4.8978 1.1230 1.1188 2.6631 1.1818 2.3958 3.6036 3.5875 2.3578 2.4243 7.1939 5.1782 6.9937 6.9794 8.6821 7.6833 6.5068 6.5253 1.0619 1.0605 1.0600 1.1005 1.1031 1.1042 1.0863 1.0862 1.0896 1.0899 1.0930 1.0960 1.0929 1.0959 1.1005 1.0997 1.0785 1.0777
irintensity: 1.0966 1.5155 0.8853 0.9546 1.9674 1.5099 0.8519 4.8518 7.5951 3.1077 6.7855 0.4238 5.2858 1.8355 1.5849 7.3134 2.4515 2.7264 2.7033 2.9989 4.3341 16.0251 17.5137 23.5974 7.2063 5.9747 1.3569 0.5443 0.3110 2.9133 2.3542 1.8059 1.4606 0.9103 0.1346 4.0205 1.9336 0.9065 0.5490 0.7787 1.5079 110.2544 9.9796 11.9296 0.4334 4.8556 16.5989 62.8806 75.1167 150.7459 61.9436 17.3109 9.1191 6.2836 1.3193 2.4323 0.8451 0.2435 31.9924 14.6533 7.7166 6.6311 15.0561 4.8252 5.8664 10.9257 5.8513 0.1144 0.0616 7.1319 6.3719 3.7390 1.3742 10.2417 7.5524 16.6312 7.8081 22.7964 4.0981 18.6874 6.1089 3.8276 27.1411 0.4332 0.3190 5.2722 1.1480 1.5292 0.1218 34.2911 16.7494 0.1749 1.1705 16.5324 7.5335 20.0629 19.1524 7.9099 14.5505 15.0084 45.3129 18.5003 2.5106 15.2305 8.0105 31.8416 39.3410 173.8371 248.0490 3.6782 27.6025 15.6754 15.0337 177.4978 118.5607 4.4892 1.6188 16.7434 71.1525 38.9106 37.1638 15.8216 16.3114 2.8622 1.9524 5.2806 6.1389 1.2829 10.4244 0.2489 14.6843 21.3973 16.1417 82.0462 39.5966
temp: 298.150 k
press: 1.00000 atm
elementType: 8 8 7 7 7 7 7 7 6 6 6 6 6 6 6 6 6 6 6 6 6 6 6 6 6 6 6 6 6 1 1 1 1 1 1 1 1 1 1 1 1 1 1 1 1 1 1
symmnumber: 1
zpe: 945623.7 jmol-1
zpe.correction: 0.360169 hartree
zpe.thermalcorrener: 0.383831 hartree
zpe.thermalcorrenthalpy: 0.384775 hartree
zpe.thermalcorrgfe: 0.304178 hartree
zpe.sumelectzpe: -1288.008999 hartree
zpe.sumelectthermal: -1287.985337 hartree
zpe.sumelectthermalent: -1287.984393 hartree
zpe.sumelectthermalfe: -1288.064990 hartree
dipole: -4.9101 -2.7053 0.7650
dipole: 5.6580
quadrupole: -152.9039 -156.7314 -172.2237
quadrupole: -16.7172 -11.3821 -15.6406
quadrupole: 7.7157 3.8883 -11.6040 -16.7172 -11.3821 -15.6406
hfenergy: -1288.3691684 hartree
pointgroup: C01 [X(C21H18N6O2)]
dipole: -1.2176447 1.747368 -0.6475043 debye
polarizability: 390.7576561|-20.0422708|205.3922725|-12.9058825|5.7815906|237.112135 unknown
InChI: InChI=1S/C21H18N6O2/c28-20(18-12-24-14-6-1-3-8-16(14)26-18)22-10-5-11-23-21(29)19-13-25-15-7-2-4-9-17(15)27-19/h1-4,6-9,12-13,22-23H,5,10-11H2
charge 0 multiplicity 1
47 atoms
O  2.412126 1.431497 1.728804
O  3.216764 -3.014495 -1.090724
N  2.804709 1.738174 -0.560712
N  3.078096 -1.330036 0.526977
N  0.189422 2.302605 -0.996009
N  0.409972 -1.858609 0.889571
N  -1.678693 2.375444 1.194011
N  -0.822168 -4.065071 -0.496111
C  4.73978 0.080812 -0.770317
C  4.260452 1.53097 -0.509849
C  4.48155 -0.921856 0.383655
C  2.005387 1.715101 0.550822
C  2.552229 -2.344179 -0.230484
C  0.558998 2.051316 0.27802
C  1.091801 -2.639797 0.024927
C  -1.146886 2.598079 -1.217917
C  -0.928775 -2.1643 1.092647
C  -2.088632 2.633071 -0.112531
C  -1.548757 -3.27574 0.393808
C  -0.375657 2.090694 1.369978
C  0.472547 -3.741323 -0.666545
C  -1.603771 2.870925 -2.543984
C  -1.707034 -1.378447 1.997342
C  -3.459334 2.938843 -0.368796
C  -2.927971 -3.566636 0.621103
C  -2.950937 3.168198 -2.765226
C  -3.054664 -1.685098 2.200781
C  -3.881273 3.202148 -1.675175
C  -3.667271 -2.782231 1.511506
H  5.835926 0.125284 -0.932302
H  4.296367 -0.317621 -1.701668
H  4.601788 1.85619 0.490573
H  4.717502 2.202547 -1.260791
H  4.810207 -0.485743 1.343707
H  5.071974 -1.834863 0.185543
H  2.328711 1.941171 -1.447759
H  2.461346 -0.830106 1.178725
H  -0.016243 1.888461 2.382926
H  1.074038 -4.338435 -1.357454
H  -0.87643 2.837175 -3.360957
H  -1.22099 -0.547048 2.515722
H  -4.148315 2.95852 0.481033
H  -3.36954 -4.410288 0.081793
H  -3.305056 3.377119 -3.780274
H  -3.651503 -1.081316 2.892418
H  -4.93235 3.437096 -1.87391
H  -4.725238 -3.0045 1.687899
