program: Gaussian 09
title: 000254456
version: EM64L-G09RevD.01
frameworkgroup: C1[X(C16H16N2O6)]
method: RPBEPBE
basis: SDD
operation: Freq
keyword: #p
keyword: freq=noraman
keyword: PBEPBE/SDD
title: #p freq=noraman PBEPBE/SDD
converged: YES YES NO NO
title: Mulliken charges:
elementType: O O O O O O N N C C C C C C C C C C C C C C C C H H H H H H H H H H H H H H H H
charge: -0.418558 -0.418591 -0.238846 -0.238891 -0.268591 -0.268456 0.023959 0.023966 0.397382 0.397497 -0.431269 -0.431262 0.100996 0.100962 -0.537327 -0.537350 0.302052 0.301898 -0.156639 -0.156733 -0.263290 -0.263281 -0.657875 -0.657881 0.304796 0.304790 0.260172 0.260183 0.385959 0.386023 0.236491 0.242872 0.236476 0.242862 0.228186 0.235783 0.253791 0.228173 0.235775 0.253795
chargesum: 0.00000
title: Mulliken charges with hydrogens summed into heavy atoms:
elementType: O O O O O O N N C C C C C C C C C C C C C C C C
charge: -0.032599 -0.032568 -0.238846 -0.238891 -0.268591 -0.268456 0.023959 0.023966 0.397382 0.397497 -0.126473 -0.126473 0.100996 0.100962 -0.277155 -0.277168 0.302052 0.301898 -0.156639 -0.156733 0.216074 0.216057 0.059884 0.059862
polarizability: 2.75699898e+02 1.41779452e-02 1.76358253e+02 2.43308914e+00 2.30494130e-02 1.75202087e+02
1716.lowfreq: -4.4796 -3.4983 0.0007 0.0009 0.0010 8.1296 15.4082 27.4944 32.2391
frequency: 15.4080 27.4845 32.2223 47.1606 47.5629 58.9325 70.4954 87.6173 97.5782 99.0804 119.0217 119.6838 126.2437 162.5642 163.4989 196.7514 200.7056 222.9059 244.3391 257.1394 266.2230 286.2287 307.3945 320.9658 332.1566 355.2991 363.1684 397.3391 420.2734 427.4077 443.8892 447.6252 460.1617 484.8270 506.5727 530.8690 611.1192 665.3538 674.6209 685.1151 701.6719 717.9569 718.1093 725.7381 737.2057 765.4186 777.3368 785.3685 810.4187 811.1913 816.4615 827.3248 875.3756 884.5966 897.2083 921.7766 972.5037 977.8663 1008.8505 1009.5630 1087.8063 1096.9223 1097.4643 1143.9979 1149.1700 1155.0734 1161.4979 1163.6255 1180.1679 1219.3649 1236.9357 1253.2389 1274.2131 1275.3785 1275.3895 1294.7389 1298.9073 1309.5254 1355.9888 1356.0016 1384.3643 1396.7197 1396.8002 1400.8517 1457.5010 1458.6259 1464.7154 1464.7898 1466.7162 1484.1683 1484.2441 1490.7860 1571.0068 1596.8443 1607.3774 1649.6598 2199.8520 2199.9381 2998.5050 2998.5259 3041.0256 3041.0834 3055.8615 3056.0468 3094.0128 3094.0443 3102.6741 3102.6853 3131.1442 3131.1537 3153.1052 3155.7607 3216.1595 3223.3561
redmass: 4.4997 4.8126 7.3468 3.2488 2.7577 5.7882 9.7141 8.6461 5.8878 5.4735 10.9920 4.6837 6.1660 6.6364 2.8641 1.6873 8.3539 1.4253 2.3904 7.5021 4.4055 4.2158 4.6006 6.8258 4.3118 5.3232 6.3929 7.9645 5.4379 11.0650 5.4227 3.6399 7.5795 3.6293 10.2157 5.0376 6.9445 5.5819 3.3064 1.8713 5.4695 1.9905 3.0183 1.6277 2.8793 5.8388 4.7051 3.3115 1.7070 1.3061 4.1323 3.0422 1.7112 1.5825 4.5443 4.0991 3.1532 3.2993 3.0526 3.0229 5.6485 2.2008 2.2170 2.3687 2.0012 2.2035 1.7016 1.8964 2.4492 1.3189 1.8864 1.5596 1.9727 1.1231 1.1268 1.5847 1.8705 1.9150 1.3553 1.3568 1.6513 1.2257 1.2268 3.6084 1.1880 1.1018 1.0635 1.0461 2.1138 1.0642 1.0535 3.3032 6.2509 7.2796 6.2775 6.2385 12.5920 12.5917 1.0363 1.0363 1.0600 1.0600 1.0833 1.0833 1.0974 1.0974 1.1027 1.1027 1.1077 1.1077 1.0915 1.0923 1.0697 1.0702
irintensity: 0.3771 2.7016 1.4687 0.0948 0.2718 0.0136 1.6151 4.1402 0.1798 2.7375 0.9359 0.4475 0.4375 6.3328 0.8485 4.0919 0.0329 0.8634 2.6087 2.2631 0.2707 3.6933 28.3937 9.3233 5.6195 35.6692 0.6406 1.7948 2.4171 1.4104 0.8432 5.4464 9.0179 6.9111 2.0773 8.8464 1.4503 59.5648 56.0248 25.8409 0.9463 11.8291 12.9428 182.1895 14.5676 0.8106 0.5892 31.6322 16.2149 10.2279 0.1154 30.9364 0.5244 26.0879 0.5306 10.2505 0.0612 2.7202 79.2027 79.8968 0.6898 7.9795 47.7705 232.5958 143.1258 9.6023 77.5307 103.7772 123.1861 29.8353 10.4063 231.1039 161.4006 1.7556 2.2870 96.3284 178.7966 37.7076 10.0573 8.8037 1.1271 42.5064 1.9682 71.7751 53.4514 7.3679 12.5519 5.0434 71.5435 3.0530 21.9023 121.9812 0.0097 13.2253 279.3101 0.0001 2.5852 3.4108 27.6047 0.7583 3.6226 34.4491 1.0088 0.0727 1.7534 48.4331 3.1388 3.0407 31.9600 13.5129 2.8425 0.0637 1123.8891 149.8292
temp: 298.150 k
press: 1.00000 atm
elementType: 8 8 8 8 8 8 7 7 6 6 6 6 6 6 6 6 6 6 6 6 6 6 6 6 1 1 1 1 1 1 1 1 1 1 1 1 1 1 1 1
symmnumber: 1
zpe: 779250.2 jmol-1
zpe.correction: 0.296801 hartree
zpe.thermalcorrener: 0.321281 hartree
zpe.thermalcorrenthalpy: 0.322225 hartree
zpe.thermalcorrgfe: 0.239827 hartree
zpe.sumelectzpe: -1178.358769 hartree
zpe.sumelectthermal: -1178.334289 hartree
zpe.sumelectthermalent: -1178.333345 hartree
zpe.sumelectthermalfe: -1178.415743 hartree
dipole: -0.0037 -9.9119 0.0064
dipole: 9.9119
quadrupole: -108.3432 -149.0938 -148.8685
quadrupole: -0.0056 -23.0454 0.0029
quadrupole: 27.0920 -13.6586 -13.4333 -0.0056 -23.0454 0.0029
hfenergy: -1178.6555699 hartree
pointgroup: C01 [X(C16H16N2O6)]
dipole: -0.0019157 -3.8996335 0.0015565 debye
polarizability: 271.5232383|-0.0012202|176.3582346|-20.2044718|0.023907|179.3787652 unknown
InChI: InChI=1S/C16H16N2O6/c1-3-23-15(21)11(7-17)9-5-14(20)10(6-13(9)19)12(8-18)16(22)24-4-2/h5-6,11-12,19-20H,3-4H2,1-2H3
charge 0 multiplicity 1
40 atoms
O  -2.150324 0.264164 -1.823738
O  2.150087 0.26655 1.824027
O  -3.877577 -1.547613 1.92085
O  3.876476 -1.549762 -1.920703
O  -3.981864 -1.072969 -0.354693
O  3.981833 -1.074408 0.354617
N  -3.975987 2.67593 0.451764
N  3.976791 2.674179 -0.452953
C  -1.319257 0.309649 0.53089
C  1.319085 0.308926 -0.530732
C  -2.719911 0.423917 1.160827
C  2.719706 0.422384 -1.16093
C  -1.122219 0.267489 -0.883709
C  1.12204 0.268514 0.883937
C  -0.198103 0.290635 1.386133
C  0.197916 0.288968 -1.385941
C  -3.598427 -0.795545 0.814536
C  3.597857 -0.797319 -0.814515
C  -3.418599 1.665469 0.750896
C  3.418955 1.66384 -0.751661
C  -4.712201 -2.79074 1.718714
C  4.710915 -2.793002 -1.718492
C  -6.200029 -2.443369 1.761222
C  6.198801 -2.445945 -1.761544
H  -2.607842 0.447692 2.257865
H  2.607411 0.44577 -2.257952
H  -0.320424 0.303202 2.474164
H  0.320227 0.30017 -2.473988
H  -3.001739 -0.124561 -1.449693
H  3.001608 -0.122522 1.45056
H  -4.402842 -3.432636 2.557426
H  -4.421105 -3.242898 0.755128
H  4.401171 -3.435056 -2.55694
H  4.42002 -3.244845 -0.754698
H  -6.792614 -3.374309 1.696374
H  -6.462631 -1.934435 2.70409
H  -6.483169 -1.798849 0.912519
H  6.791215 -3.376989 -1.696645
H  6.461217 -1.937303 -2.704622
H  6.482335 -1.801269 -0.913091
