program: Gaussian 09
title: 000250370
version: EM64L-G09RevD.01
frameworkgroup: C1[X(C6H9N3O2)]
method: RPBEPBE
basis: SDD
operation: Freq
keyword: #pfreq=noraman
keyword: PBEPBE/SDD
title: #p freq=noraman PBEPBE/SDD
converged: YES YES NO NO
title: Mulliken charges:
elementType: O O N N N C C C C C C H H H H H H H H H
charge: -0.302126 -0.220997 -0.103125 -0.003254 -0.626257 0.215645 0.137296 -0.367696 -0.013425 -0.523281 -0.505634 0.250233 0.346618 0.327530 0.243330 0.228002 0.227993 0.229786 0.229723 0.229639
chargesum: 0.00000
title: Mulliken charges with hydrogens summed into heavy atoms:
elementType: O O N N N C C C C C C
charge: -0.302126 -0.220997 -0.103125 -0.003254 0.047891 0.215645 0.137296 -0.117463 -0.013425 0.176044 0.183514
polarizability: 1.38548435e+02 2.44462217e+00 1.01105074e+02 -1.83505683e-02 1.84324481e-02 4.86567436e+01
1716.lowfreq: -7.1296 -6.0995 -0.0011 0.0003 0.0006 7.1114 59.7978 106.1066 136.6203
frequency: 59.7889 106.0784 136.6201 168.2716 178.8054 215.5044 223.4075 232.9438 309.3029 372.3353 434.0057 447.3440 471.2000 501.3642 531.5241 540.3743 600.0923 681.9717 691.7430 743.5850 769.7482 885.5820 904.9118 969.1965 996.9482 1065.7122 1112.9553 1113.7166 1155.0165 1155.7095 1194.5611 1274.2977 1292.8225 1324.8230 1354.3179 1433.3938 1446.9380 1449.6662 1461.8931 1463.2518 1473.4622 1477.5599 1547.1523 1557.4306 1614.5937 2963.9195 2992.1216 3053.2026 3089.8749 3127.7419 3133.3134 3148.1935 3550.2352 3706.0393
redmass: 3.2234 3.9543 1.7215 1.6010 3.4190 3.1404 2.1662 1.7288 3.4334 5.5082 2.5489 4.5927 5.0506 1.4128 6.8911 1.0906 5.0074 6.3010 10.6432 6.8311 10.2957 1.4120 4.2971 9.6047 5.0986 2.1676 1.2535 1.2587 1.4639 1.4959 5.0190 3.9174 2.6189 5.9348 2.3848 1.1871 1.3658 1.0521 1.2280 1.0496 1.2034 1.9345 2.6607 5.8748 1.8351 1.0323 1.0296 1.1043 1.1040 1.1002 1.1039 1.0915 1.0440 1.1056
irintensity: 7.9911 0.4386 4.0707 6.0475 9.2669 2.8757 0.7581 0.0705 2.8161 3.9590 42.5766 13.0915 5.0709 270.3892 8.0790 0.0128 1.6339 18.6536 0.4533 1.1457 13.6049 22.0183 20.1641 2.1941 103.8582 44.5219 0.2157 0.0970 23.5090 52.1495 77.9992 68.7495 140.7631 36.0914 353.2956 20.6115 102.3353 12.4897 107.4822 14.5309 62.0179 48.2640 71.9143 24.9007 430.7327 62.4576 55.5057 44.7254 37.3231 23.3221 28.4289 22.3342 95.8547 50.1640
temp: 298.150 k
press: 1.00000 atm
elementType: 8 8 7 7 7 6 6 6 6 6 6 1 1 1 1 1 1 1 1 1
symmnumber: 1
zpe: 406171.5 jmol-1
zpe.correction: 0.154703 hartree
zpe.thermalcorrener: 0.165673 hartree
zpe.thermalcorrenthalpy: 0.166617 hartree
zpe.thermalcorrgfe: 0.118262 hartree
zpe.sumelectzpe: -547.881626 hartree
zpe.sumelectthermal: -547.870656 hartree
zpe.sumelectthermalent: -547.869711 hartree
zpe.sumelectthermalfe: -547.918066 hartree
dipole: 3.4806 3.2978 -0.0014
dipole: 4.7948
quadrupole: -49.2007 -62.1438 -66.3772
quadrupole: -9.6770 0.0015 -0.0194
quadrupole: 10.0399 -2.9032 -7.1366 -9.6770 0.0015 -0.0194
hfenergy: -548.0363283 hartree
pointgroup: C01 [X(C6H9N3O2)]
dipole: -1.4237753 -1.2370879 -0.0329183 debye
dipolederiv: -1.6866881 0.1970931 0.0205088 0.0657507 -0.3615705 -0.0033511 0.0159971 -0.0051181 -0.290977 -1.8526424 0.1797745 0.0189926 0.0465179 -0.3432843 -0.0009282 0.0139911 -0.002143 -0.3263046 -0.8523298 -0.2992056 -0.00568 -0.328057 -0.6585813 -0.0131985 -0.0072434 -0.0136975 -0.2224286 -1.1275014 -0.2101411 -0.0000836 0.4796121 -0.4861802 -0.0133142 0.0241127 -0.0073159 -0.2288668 -0.3445288 -0.408042 -0.0179753 -0.4673109 -1.3169203 -0.0172786 -0.0195954 -0.0167406 -0.7108279 1.1593785 0.1862791 -0.0038189 0.0298616 -0.6747792 -0.0281902 -0.009062 -0.0287428 0.0826562 0.4221814 0.3032308 0.0092435 0.6498246 1.611751 0.0463151 0.0218618 0.0496781 0.1832684 0.5408444 0.320755 0.0063146 -0.1103965 0.4250634 0.0204532 -0.0092114 0.0162852 -0.1233546 2.136357 0.0306983 -0.0145557 0.0133773 0.5059072 0.0114611 -0.0141739 0.0113552 0.1893452 0.6461041 -0.1669802 -0.0089484 -0.4710716 0.4038797 0.0071472 -0.0205583 0.0043324 0.3291911 0.7136986 -0.1290061 -0.0080968 -0.411543 0.3568921 0.005611 -0.0183506 0.0033059 0.2888872 -0.0139689 0.105571 0.0049373 0.1347755 0.0130228 -0.0054768 0.0058996 -0.0052741 0.1368214 0.2237317 0.070382 0.0038351 0.0140874 0.2532063 -0.0051109 0.0013633 -0.0061676 0.3867072 0.1536334 -0.0097687 0.0017591 0.0200197 0.2549052 -0.005012 0.002765 -0.0054639 0.3802506 -0.1348763 -0.0361956 0.0018832 -0.087428 0.0605908 -0.0009332 0.0002326 -0.0015159 0.1243596 0.0466706 -0.0322594 0.0575788 0.1351721 -0.0420315 0.1027599 -0.0091637 0.1097752 -0.0778333 0.0459397 -0.0311243 -0.0636559 0.1313192 -0.0270307 -0.1018418 0.0152805 -0.1053773 -0.0913717 0.0461469 -0.0130177 -0.0555285 0.1256653 -0.0101298 -0.0944054 0.0068146 -0.1022709 -0.081732 0.0468498 -0.0148597 0.0521334 0.1278865 -0.0244258 0.0964817 -0.000131 0.106794 -0.068751 -0.1690004 -0.0431832 0.0011568 -0.0980629 0.059715 -0.0011884 -0.0008287 -0.0016984 0.1209606 unknown
polarizability: 138.6822682|0.8569721|100.8967955|-0.756982|1.8786679|48.7311891 unknown
InChI: InChI=1S/C6H9N3O2/c1-10-4-3-8-6(11-2)9-5(4)7/h3H,7H2,1-2H3
charge 0 multiplicity 1
20 atoms
O  -2.660167 -0.220558 0.017061
O  2.761543 0.704837 0.003197
N  0.956374 -0.815828 -0.037645
N  0.63711 1.603122 0.0522
N  -0.889097 -2.287048 -0.07499
C  -1.292465 0.11168 0.015994
C  -0.393283 -1.006852 -0.032526
C  -0.721008 1.392962 0.056235
C  1.394707 0.477313 0.00567
C  -3.609609 0.896091 0.068772
C  3.632139 -0.483666 -0.047297
H  -1.337003 2.297284 0.092548
H  -1.895699 -2.43306 -0.072735
H  -0.24019 -3.069088 -0.110956
H  -4.606337 0.431556 0.06593
H  -3.497367 1.553407 -0.814928
H  -3.473485 1.489351 0.993615
H  3.446314 -1.069246 -0.964368
H  3.463532 -1.13259 0.829626
H  4.651992 -0.071468 -0.042403
