program: Gaussian 09
title: 000250368
version: EM64L-G09RevD.01
frameworkgroup: C1[X(C10H16N3OP)]
method: RPBEPBE
basis: SDD
operation: Freq
keyword: #p
keyword: freq=noraman
keyword: PBEPBE/SDD
title: #p freq=noraman PBEPBE/SDD
converged: YES YES NO NO
title: Mulliken charges:
elementType: P O N N N C C C C C C C C C C H H H H H H H H H H H H H H H H
charge: 1.311848 -0.599411 -0.683529 -0.701413 -0.831087 -0.303822 -0.366592 -0.365614 0.515540 -0.427053 -0.374853 0.454268 -0.408411 -0.358666 -0.812049 0.226462 0.194075 0.215995 0.227724 0.227554 0.216450 0.331449 0.333438 0.332899 0.211624 0.310717 0.224854 0.224714 0.227459 0.219013 0.226420
chargesum: 0.00000
title: Mulliken charges with hydrogens summed into heavy atoms:
elementType: P O N N N C C C C C C C C C C
charge: 1.311848 -0.599411 -0.352080 -0.367975 -0.498189 0.116715 0.077128 0.078390 0.515540 -0.215430 -0.064136 0.454268 -0.183557 -0.133952 -0.139157
polarizability: 2.32309724e+02 5.95421423e+00 1.35842694e+02 1.22820544e+00 -3.30544642e-01 1.00136279e+02
1716.lowfreq: -8.5663 0.0012 0.0018 0.0024 5.7421 8.9978 13.1808 29.6559 47.3174
frequency: 7.0538 29.4224 47.1435 54.1677 107.6347 135.1062 142.6943 153.4662 204.4284 248.6176 294.0018 299.4038 319.2114 343.1835 355.2091 364.1402 408.7129 444.6829 450.2871 469.4996 508.9688 526.1925 586.6293 594.7704 634.4852 692.1354 718.3565 725.2277 789.7065 797.6730 814.9253 840.8713 852.5257 888.8488 889.5231 935.8788 953.0902 978.5595 986.5606 986.9879 1007.7683 1017.3117 1046.6114 1103.7731 1108.3339 1124.9387 1129.3202 1193.8161 1197.0921 1203.9132 1223.1231 1253.4367 1268.6291 1310.5164 1331.3535 1333.4870 1343.3176 1344.3464 1396.6075 1399.1259 1403.7258 1423.0996 1441.8164 1444.8709 1470.9639 1475.6951 1480.4655 1489.4698 1511.2317 1586.8395 1630.5793 2931.9496 2936.3088 2970.8532 3001.4241 3036.6186 3041.3858 3047.1856 3073.2883 3077.1950 3104.8421 3116.8360 3132.4040 3157.9448 3522.9917 3526.8421 3535.2394
redmass: 4.3735 1.0453 3.8254 3.7759 3.5413 3.3123 4.8865 2.3572 6.1839 5.8250 2.2147 3.5592 2.8143 2.5411 2.1968 3.0207 2.9752 4.3038 4.7103 1.5112 2.3488 3.3186 1.3459 2.9086 6.4438 3.4412 2.9446 4.6335 4.0062 5.5969 1.4898 2.5385 1.2955 3.8380 1.5106 1.3547 2.5450 2.3159 1.3860 1.3550 3.2131 8.5997 1.5239 1.9184 3.1299 3.2775 1.3161 1.1385 1.1203 1.1558 2.3415 2.3719 1.1947 1.4972 1.1652 1.3275 1.9170 1.5302 1.3017 1.4102 2.7543 1.3274 1.7140 1.1333 1.0462 1.0766 1.1422 1.0791 2.7716 5.5252 6.3010 1.0690 1.0684 1.0371 1.0617 1.0937 1.0929 1.0976 1.1032 1.0985 1.0870 1.0900 1.0962 1.0955 1.0756 1.0757 1.0751
irintensity: 0.4115 0.4351 0.1547 3.5648 3.5602 4.9430 9.5092 3.2157 4.0486 2.7913 9.0209 21.8813 1.9980 5.2889 1.0676 0.9531 0.0318 21.3252 4.8807 215.6340 49.2858 0.8746 98.7544 62.4024 16.6516 29.5198 0.7597 35.5234 80.4486 43.1387 70.2407 29.1726 27.1717 156.3266 23.1132 3.7782 51.4268 6.6529 2.7982 6.0716 16.5887 100.0626 10.4110 4.7565 204.1611 3.2390 19.7097 0.0798 3.2242 0.6106 2.0046 93.1280 1.5133 89.0265 15.9560 199.6529 20.6373 8.3596 0.0707 5.8140 23.5736 34.7169 48.9751 8.7567 11.8924 6.1844 14.4285 3.6077 252.8281 3.2207 74.4557 34.6923 136.6690 58.6706 25.0463 37.5298 44.4548 26.1074 45.5596 21.7359 21.8239 25.8904 22.4004 11.5613 17.7626 19.4195 18.8577
temp: 298.150 k
press: 1.00000 atm
elementType: 15 8 7 7 7 6 6 6 6 6 6 6 6 6 6 1 1 1 1 1 1 1 1 1 1 1 1 1 1 1 1
symmnumber: 1
zpe: 666851.5 jmol-1
zpe.correction: 0.253990 hartree
zpe.thermalcorrener: 0.269736 hartree
zpe.thermalcorrenthalpy: 0.270680 hartree
zpe.thermalcorrgfe: 0.208207 hartree
zpe.sumelectzpe: -970.220375 hartree
zpe.sumelectthermal: -970.204630 hartree
zpe.sumelectthermalent: -970.203686 hartree
zpe.sumelectthermalfe: -970.266158 hartree
dipole: -3.3834 -3.1260 0.3500
dipole: 4.6197
quadrupole: -76.7030 -101.4598 -92.9157
quadrupole: 3.0270 0.2834 1.6326
quadrupole: 13.6565 -11.1003 -2.5562 3.0270 0.2834 1.6326
hfenergy: -970.4743656 hartree
pointgroup: C01 [X(C10H16N3O1P1)]
dipole: -1.3120419 -0.8491402 -0.927881 debye
polarizability: 231.5187052|-1.4487301|114.8308389|11.3691368|17.371802|121.9391538 unknown
InChI: InChI=1S/C10H16N3OP/c1-9-3-5-10(6-4-9)13-15(14)11-7-2-8-12-15/h3-6,11-13H,2,7-8H2,1H3
charge 0 multiplicity 1
31 atoms
P  -1.580389 0.557625 0.143611
O  -1.151114 1.613102 1.271658
N  -2.575559 -0.796924 0.641944
N  -2.544317 1.107408 -1.208881
N  -0.200434 -0.159056 -0.648358
C  -4.558793 -0.291326 -0.776733
C  -4.059719 -0.723015 0.616729
C  -4.029342 1.104902 -1.162973
C  1.18853 -0.066826 -0.347063
C  2.089804 -0.842129 -1.125087
C  1.709997 0.76141 0.684573
C  4.014848 0.025578 0.149289
C  3.478161 -0.78997 -0.877183
C  3.099981 0.793456 0.915905
C  5.508717 0.076695 0.424215
H  -4.229813 -1.03005 -1.529607
H  -5.665299 -0.266777 -0.770346
H  -4.457793 -0.024935 1.386617
H  -4.444466 -1.731644 0.854331
H  -4.391089 1.375983 -2.171612
H  -4.427231 1.863216 -0.452459
H  -2.174314 -1.341561 1.411551
H  -2.117419 1.875217 -1.735879
H  -0.44979 -0.78648 -1.417213
H  1.704034 -1.486393 -1.926162
H  1.025613 1.36918 1.283698
H  4.152491 -1.397529 -1.493457
H  3.482723 1.439074 1.71698
H  5.747697 -0.301452 1.43681
H  6.073222 -0.534675 -0.301492
H  5.896862 1.111195 0.365496
