program: Gaussian 09
title: 000254455
version: EM64L-G09RevD.01
frameworkgroup: C1[X(C22H18O2)]
method: RPBEPBE
basis: SDD
operation: Freq
keyword: #pfreq=noraman
keyword: PBEPBE/SDD
title: #p freq=noraman PBEPBE/SDD
converged: YES YES NO NO
title: Mulliken charges:
elementType: O O C C C C C C C C C C C C C C C C C C C C C C H H H H H H H H H H H H H H H H H H
charge: -0.184432 -0.184520 0.298612 0.298889 0.290218 0.291232 -0.040547 -0.041113 -0.340396 -0.340200 -0.356274 -0.355974 0.431006 0.432476 -0.363123 -0.363273 -0.363092 -0.363250 -0.379599 -0.380475 -0.379993 -0.380716 -0.804683 -0.805086 0.260810 0.261145 0.281261 0.281229 0.244986 0.244985 0.244986 0.244985 0.233905 0.234055 0.233909 0.234062 0.228002 0.236104 0.228035 0.225662 0.225674 0.240519
chargesum: 0.00000
title: Mulliken charges with hydrogens summed into heavy atoms:
elementType: O O C C C C C C C C C C C C C C C C C C C C C C
charge: -0.184432 -0.184520 0.298612 0.298889 0.290218 0.291232 -0.040547 -0.041113 -0.079586 -0.079055 -0.075013 -0.074745 0.431006 0.432476 -0.118137 -0.118288 -0.118106 -0.118265 -0.145694 -0.146420 -0.146084 -0.146655 -0.112543 -0.113230
polarizability: 3.07819700e+02 4.88328386e-01 2.58671266e+02 -1.85923411e-02 -3.42124727e-02 1.81936280e+02
1716.lowfreq: -67.6934 -64.2750 -2.8844 -2.2802 -0.0009 0.0005 0.0007 10.7028 18.8631
frequency: -67.6919 -64.2733 18.6401 25.6707 32.0900 47.3028 49.7607 55.9185 64.9305 121.2492 131.3170 160.7599 162.1551 180.5845 243.6768 266.7461 272.6449 309.4414 331.2550 339.5071 345.6594 390.0759 390.3525 397.2033 401.4290 429.3322 465.7192 517.5682 540.6686 555.0947 595.7773 618.3459 626.2156 628.5844 630.3636 681.7966 715.4660 722.2913 729.1940 730.7540 783.4995 791.5720 792.5452 823.2902 825.1397 849.1376 849.4745 865.4011 894.8600 909.0641 915.7510 953.6889 954.0104 970.4137 970.7829 987.3706 989.1223 991.1098 1008.9053 1014.5654 1015.2801 1021.0739 1047.7896 1048.1203 1111.9140 1123.2694 1123.3932 1142.1720 1152.9612 1187.4498 1195.4688 1196.4276 1222.6053 1222.9761 1265.3849 1279.1980 1301.9129 1306.5998 1306.7753 1354.8565 1355.1531 1379.8998 1398.4512 1398.6875 1398.7674 1400.5260 1408.5355 1469.6563 1471.0973 1474.0726 1474.1971 1480.9637 1500.9458 1500.9805 1544.4296 1561.8835 1573.0444 1573.2347 1588.1650 1614.8546 1619.9859 1620.1680 2976.7595 2977.6339 3058.5888 3059.3227 3087.5023 3087.7110 3120.5441 3120.6006 3121.6642 3121.7516 3143.0058 3143.1666 3143.2466 3148.2265 3148.3684 3148.5711 3161.7521 3167.5440
redmass: 4.4734 4.4095 5.5526 4.5681 1.0206 4.5888 4.8173 1.0232 4.7263 4.5341 6.2072 5.3215 4.4853 7.0594 5.6874 5.3827 6.1811 4.9437 8.5808 2.6509 2.6833 2.8463 2.8355 4.2474 2.8547 4.1384 3.7745 4.2279 4.5387 4.2989 3.9056 5.0589 6.9037 6.5786 6.0004 5.2402 5.8120 3.1866 3.1505 3.1163 3.8398 5.4671 4.4601 1.6450 1.7316 1.2546 1.2496 1.3288 1.6459 4.8565 5.0058 1.3995 1.4137 1.3854 1.3840 1.3974 1.3975 1.3833 2.8553 2.9673 2.8083 1.3582 1.5660 1.5629 1.3526 1.3341 1.3338 3.7773 3.0790 1.2265 1.1081 1.1166 3.0483 2.9445 3.5719 5.1421 1.2838 1.2945 1.2953 4.9069 4.9158 5.2244 1.2226 3.2181 3.2132 1.2230 4.4285 1.0919 1.0918 1.0535 1.0546 2.4725 2.6573 2.6741 8.5457 11.5188 5.8830 5.8629 9.3243 6.4585 6.3053 6.3099 1.0388 1.0386 1.0949 1.0952 1.0999 1.0998 1.0876 1.0876 1.0877 1.0877 1.0879 1.0961 1.0961 1.0944 1.0973 1.0913 1.0959 1.0973
irintensity: 1.2263 0.0221 0.0101 0.1122 0.3316 1.2149 0.2167 0.8017 2.8279 1.6413 0.0004 1.5940 0.0155 0.8958 0.0001 2.9836 19.2576 0.8552 2.2387 1.2782 0.0598 0.1472 0.0706 0.0155 0.0013 9.4359 5.2683 36.7333 7.9778 0.8051 0.1199 13.0057 0.0000 1.5653 13.9112 0.0001 5.9984 28.9678 1.3832 0.6480 66.7637 0.0003 2.1092 63.6437 70.3854 0.2784 0.0917 2.8788 32.1659 141.0829 26.4754 0.8469 3.0987 0.0076 0.0106 0.0980 0.2830 0.0120 3.3350 4.5583 4.6064 0.0000 23.9018 14.4973 6.0526 5.2713 15.8380 0.1333 42.5489 13.9041 20.1702 0.4696 15.3182 3.4040 605.1540 50.2181 3.8720 0.2765 0.5299 0.2725 0.3142 0.7394 12.3590 1.9649 1.9778 12.1950 20.1967 13.9352 14.4055 13.8622 11.8556 41.1412 13.3115 4.7258 108.5921 181.0235 0.1917 0.2515 24.5944 5.6959 11.6467 26.1667 32.9489 34.8948 23.1053 19.6651 16.4777 17.6098 3.5703 4.7441 16.9471 20.5900 2.4424 6.8323 50.0428 2.4742 0.6385 0.0201 6.3979 0.4526
temp: 298.150 k
press: 1.00000 atm
elementType: 8 8 6 6 6 6 6 6 6 6 6 6 6 6 6 6 6 6 6 6 6 6 6 6 1 1 1 1 1 1 1 1 1 1 1 1 1 1 1 1 1 1
symmnumber: 1
zpe: 863910.4 jmol-1
zpe.correction: 0.329046 hartree
zpe.thermalcorrener: 0.349266 hartree
zpe.thermalcorrenthalpy: 0.350210 hartree
zpe.thermalcorrgfe: 0.276785 hartree
zpe.sumelectzpe: -997.937344 hartree
zpe.sumelectthermal: -997.917124 hartree
zpe.sumelectthermalent: -997.916180 hartree
zpe.sumelectthermalfe: -997.989605 hartree
dipole: 0.1045 6.4805 0.0012
dipole: 6.4813
quadrupole: -143.4496 -142.1361 -128.6486
quadrupole: -0.0594 -0.0016 -0.0125
quadrupole: -5.3715 -4.0580 9.4295 -0.0594 -0.0016 -0.0125
hfenergy: -998.2663897 hartree
pointgroup: C01 [X(C22H18O2)]
dipole: 0.0369721 2.5496703 -0.0003195 debye
polarizability: 307.8179893|0.5679238|258.6729471|-0.0169843|-0.0584561|181.9363087 unknown
InChI: InChI=1S/C22H18O2/c1-15-3-7-17(8-4-15)21(23)19-11-13-20(14-12-19)22(24)18-9-5-16(2)6-10-18/h3-14H,1-2H3
charge 0 multiplicity 1
42 atoms
O  -3.545874 -2.729202 0.000577
O  3.5487 -2.718528 0.00059
C  -1.420518 -1.586866 0.000394
C  1.419783 -1.582643 0.00043
C  -3.682068 -0.314204 0.000107
C  3.677719 -0.303389 0.000235
C  -2.924125 -1.625792 0.000368
C  2.923474 -1.617083 0.000436
C  -0.707029 -0.359156 0.000357
C  0.702677 -0.357033 0.000373
C  -0.699579 -2.815918 0.000473
C  0.702507 -2.813839 0.000493
C  -5.192835 2.115832 -0.000511
C  5.174085 2.135418 -0.000197
C  -4.060694 0.295981 -1.220735
C  4.053009 0.309329 1.220821
C  -4.064084 0.29448 1.22062
C  4.051266 0.309962 -1.220559
C  -4.807734 1.494093 -1.216401
C  4.790285 1.513494 1.215988
C  -4.811079 1.492641 1.21567
C  4.788575 1.514121 -1.21615
C  -5.972611 3.419056 -0.000858
C  5.997122 3.411744 -0.00042
H  -1.25864 0.586572 0.000334
H  1.25142 0.590367 0.000349
H  -1.27133 -3.749773 0.00051
H  1.276998 -3.746015 0.00055
H  -3.783062 -0.170254 -2.172938
H  3.773313 -0.155152 2.173285
H  -3.789118 -0.172927 2.173019
H  3.770208 -0.154011 -2.172871
H  -5.100057 1.949089 -2.17056
H  5.07382 1.974442 2.169943
H  -5.106009 1.946495 2.169566
H  5.070775 1.97555 -2.170267
H  -6.614763 3.506787 0.892966
H  -5.289719 4.290956 -0.001933
H  -6.615954 3.505589 -0.893958
H  5.792927 4.026459 -0.894604
H  5.792285 4.027185 0.893127
H  7.080537 3.182744 0.000082
