program: Gaussian 09
title: 000250367
version: EM64L-G09RevD.01
frameworkgroup: C1[X(C8H13Cl2N3O2)]
method: RPBEPBE
basis: SDD
operation: Freq
keyword: #p
keyword: freq=noraman
keyword: PBEPBE/SDD
title: #p freq=noraman PBEPBE/SDD
converged: YES YES NO NO
title: Mulliken charges:
elementType: Cl Cl O O N N N C C C C C C C C H H H H H H H H H H H H H
charge: -0.048552 -0.061520 -0.244833 -0.308814 -0.150805 -0.600127 -0.634956 -0.412625 -0.363106 0.295908 -0.578974 -0.583188 -0.426750 0.106249 0.253056 0.236154 0.351893 0.243919 0.265144 0.281569 0.256081 0.326927 0.263985 0.207749 0.339662 0.342808 0.336113 0.307033
chargesum: 0.00000
title: Mulliken charges with hydrogens summed into heavy atoms:
elementType: Cl Cl O O N N N C C C C C C C C
charge: -0.048552 -0.061520 -0.244833 -0.308814 -0.150805 0.082343 0.008190 0.175422 0.145957 0.295908 -0.041324 0.007723 -0.219001 0.106249 0.253056
polarizability: 1.86362131e+02 1.57068765e+01 1.47909426e+02 8.93262330e+00 -1.06211065e+01 9.53230252e+01
1716.lowfreq: -8.6877 -0.0020 -0.0019 0.0004 3.0483 4.8967 14.6291 29.2919 42.5461
frequency: 13.9533 29.2165 42.5382 58.2869 73.1949 76.4755 87.5384 135.4269 142.8538 166.3329 199.4839 216.4934 238.3175 261.4336 263.2678 320.9721 372.6578 379.4875 443.7395 473.9092 484.5798 531.3122 544.0436 552.2399 601.9693 636.7893 664.0695 673.6848 703.1524 714.0490 737.6353 770.9502 791.3778 797.9267 809.8910 916.1253 953.7139 1005.3027 1032.9223 1039.6144 1045.6711 1051.1946 1059.5229 1108.7132 1146.5290 1222.9159 1254.5595 1262.4806 1265.4203 1289.3071 1303.5575 1334.9645 1340.8553 1357.4056 1390.2331 1452.7742 1454.4040 1466.9597 1478.7943 1499.3247 1565.9841 1579.5668 1596.9735 1616.7768 1629.8629 2981.6865 3026.4044 3049.1006 3067.5770 3067.9417 3095.9035 3116.4790 3134.9822 3165.4337 3508.6976 3528.0470 3666.8024 3684.8634
redmass: 10.3679 6.9425 8.5081 7.3244 6.2335 6.8294 2.4641 4.5144 2.6241 6.5344 8.8161 4.3715 6.9763 4.0513 4.3943 6.1967 3.7076 3.5001 1.2035 2.9610 3.8202 1.6761 1.6139 1.1699 1.8315 2.5993 3.9305 6.5407 3.0651 3.6147 5.3540 3.3562 1.2552 1.1682 1.8852 4.7753 3.7213 1.5436 1.5432 2.8783 3.5221 2.4021 1.8051 1.8987 1.5388 1.9048 1.4546 1.2014 1.1845 2.2783 1.3180 1.7800 2.2263 1.2502 1.2084 1.1087 1.0965 1.5660 1.1355 1.6185 2.3190 1.6287 4.5816 1.5786 3.0075 1.0668 1.0625 1.0570 1.0598 1.1005 1.1011 1.0870 1.1110 1.1113 1.0449 1.0445 1.1046 1.1047
irintensity: 2.1480 3.2472 3.1673 7.0761 2.9191 5.9720 0.8029 3.1593 4.2117 7.3263 7.3456 1.9641 3.7447 2.4133 15.3437 4.2462 11.2190 11.8329 132.7488 29.2017 10.6678 86.3781 91.9720 47.0004 113.4882 23.5268 13.6780 53.4603 5.5112 61.6848 44.8890 2.8918 16.7700 20.1181 42.2494 11.8725 15.6295 5.5647 3.3620 1.9392 9.7540 5.9127 0.8036 54.0466 42.0657 13.5166 15.2192 23.5767 11.2901 220.9004 37.6215 67.6566 150.9437 1.9825 6.1782 16.9317 13.7405 15.3338 61.8273 53.1072 230.0898 41.4257 510.3293 327.0672 209.9696 92.6493 22.3236 20.9238 15.0079 6.2606 12.6079 6.5458 7.8784 2.8672 44.2513 66.5766 29.9222 26.8035
temp: 298.150 k
press: 1.00000 atm
elementType: 17 17 8 8 7 7 7 6 6 6 6 6 6 6 6 1 1 1 1 1 1 1 1 1 1 1 1 1
symmnumber: 1
zpe: 567183.0 jmol-1
zpe.correction: 0.216029 hartree
zpe.thermalcorrener: 0.233200 hartree
zpe.thermalcorrenthalpy: 0.234144 hartree
zpe.thermalcorrgfe: 0.167626 hartree
zpe.sumelectzpe: -1546.316854 hartree
zpe.sumelectthermal: -1546.299683 hartree
zpe.sumelectthermalent: -1546.298738 hartree
zpe.sumelectthermalfe: -1546.365256 hartree
dipole: -2.7119 -4.8371 4.8498
dipole: 7.3670
quadrupole: -113.9506 -99.8623 -99.0252
quadrupole: 17.7844 -1.1813 -10.6150
quadrupole: -9.6712 4.4170 5.2542 17.7844 -1.1813 -10.6150
hfenergy: -1546.5328822 hartree
pointgroup: C01 [X(C8H13Cl2N3O2)]
dipole: -0.8150724 -0.3321326 2.7615439 debye
polarizability: 179.9981873|24.3887684|120.9297994|-3.8713565|-29.7915855|128.6665956 unknown
InChI: InChI=1S/C8H13Cl2N3O2/c9-1-3-13(4-2-10)6(8(12)15)5-7(11)14/h5H,1-4,11-12H2
charge 0 multiplicity 1
28 atoms
Cl -2.403684 3.132253 -1.962842
Cl 4.251774 1.431042 -1.697206
O  2.345716 -1.296394 1.091697
O  -2.531362 -1.028146 -1.182781
N  0.414363 0.535007 -0.400165
N  1.002545 -0.559204 2.836406
N  -3.299058 -2.030817 0.745876
C  -0.577916 1.102621 -1.351404
C  1.760408 1.16893 -0.472114
C  0.10605 -0.422369 0.552801
C  -1.3293 2.266572 -0.679178
C  2.662922 0.430666 -1.475619
C  -1.056343 -1.155966 0.796878
C  1.257345 -0.792655 1.498264
C  -2.304316 -1.360117 0.032165
H  -0.036155 1.475166 -2.238099
H  -1.297136 0.324426 -1.661459
H  1.628588 2.216695 -0.796655
H  2.250829 1.187752 0.513911
H  -2.02081 1.915664 0.100696
H  -0.655287 3.04374 -0.285116
H  2.965175 -0.552703 -1.093062
H  2.211901 0.361523 -2.476749
H  -0.983631 -1.795262 1.685188
H  0.13663 -0.119999 3.145121
H  1.703612 -0.836623 3.524715
H  -4.160211 -2.25845 0.251082
H  -3.193351 -2.309252 1.718849
