program: Gaussian 09
title: 000250366
version: EM64L-G09RevD.01
frameworkgroup: C1[X(C7H9N3OS)]
method: RPBEPBE
basis: SDD
operation: Freq
keyword: #p
keyword: freq=noraman
keyword: PBEPBE/SDD
title: #p freq=noraman PBEPBE/SDD
converged: YES YES NO NO
title: Mulliken charges:
elementType: S O N N N C C C C C C C H H H H H H H H H
charge: 0.309553 -0.243613 0.061885 -0.391269 -0.650012 0.445557 -0.268850 -0.273957 -0.803369 -0.520181 -0.300920 0.303416 0.248447 0.232001 0.235393 0.231988 0.264477 0.210981 0.262697 0.346266 0.299509
chargesum: 0.00000
title: Mulliken charges with hydrogens summed into heavy atoms:
elementType: S O N N N C C C C C C C
charge: 0.309553 -0.243613 0.061885 -0.128571 -0.004238 0.445557 -0.268850 -0.025510 -0.103986 -0.255704 -0.089939 0.303416
polarizability: 2.33374782e+02 -4.56196869e+00 1.28030725e+02 1.12285080e-02 -2.32280371e-03 5.06831714e+01
1716.lowfreq: -4.7818 -4.4230 -2.3834 -0.0012 0.0006 0.0012 27.0393 47.7161 60.1120
frequency: 26.3833 47.5837 60.1114 62.7796 143.9787 160.4619 177.8742 210.3072 234.7899 326.6572 351.2248 351.5263 413.8410 482.1092 484.5832 496.6820 548.7259 572.9008 626.7783 643.3535 652.3083 704.2715 705.9314 721.4113 775.5466 885.3393 909.9450 913.3738 951.8983 1025.8731 1036.3224 1039.2653 1099.4311 1121.6606 1229.7977 1257.2623 1286.0072 1327.3747 1375.9012 1398.3296 1456.2204 1476.2587 1484.3549 1507.9169 1537.3348 1596.1415 1604.9834 1683.8116 2971.3457 2977.2543 3051.7263 3088.9635 3170.2807 3236.2973 3363.3618 3539.3968 3697.1956
redmass: 4.4301 1.0576 4.1240 6.4813 4.7552 2.2006 5.8974 3.6344 4.7301 1.7350 3.1933 4.6543 4.5065 1.1846 5.0586 3.5782 4.3076 1.2680 3.4344 6.2176 7.1879 5.0500 8.6103 1.2646 5.3289 1.2930 3.0517 1.4811 2.1872 1.7585 1.4824 2.5872 1.2179 6.5051 1.5402 2.4996 2.1866 1.8716 3.7572 1.2250 2.7080 1.0456 1.3814 2.1099 5.4763 6.0083 1.2157 5.4182 1.0784 1.0448 1.0981 1.0975 1.0923 1.0991 1.0749 1.0460 1.1035
irintensity: 15.8177 1.4056 1.1221 5.5561 0.0218 3.8806 4.7663 1.1754 0.3693 75.4917 22.1560 3.1134 4.8351 211.7872 12.6547 21.6312 5.0689 138.6095 2.9845 3.5429 2.1790 8.0790 17.6921 79.0657 13.1290 1.6907 6.3469 29.3507 5.2926 9.0265 5.9954 24.4087 3.0925 211.5481 5.2231 16.3962 572.2991 77.9701 1.6061 9.9553 12.0568 14.9165 43.8869 359.0054 78.5424 14.8869 125.8180 288.8518 29.2196 61.6203 21.6898 19.9726 12.5315 0.1368 13.8484 64.1050 47.7092
temp: 298.150 k
press: 1.00000 atm
elementType: 16 8 7 7 7 6 6 6 6 6 6 6 1 1 1 1 1 1 1 1 1
symmnumber: 1
zpe: 408421.5 jmol-1
zpe.correction: 0.155560 hartree
zpe.thermalcorrener: 0.168415 hartree
zpe.thermalcorrenthalpy: 0.169359 hartree
zpe.thermalcorrgfe: 0.114407 hartree
zpe.sumelectzpe: -908.766555 hartree
zpe.sumelectthermal: -908.753700 hartree
zpe.sumelectthermalent: -908.752756 hartree
zpe.sumelectthermalfe: -908.807708 hartree
dipole: 0.2081 6.7301 -0.0009
dipole: 6.7333
quadrupole: -55.4842 -72.0129 -82.3408
quadrupole: -17.6964 0.0052 -0.0006
quadrupole: 14.4618 -2.0669 -12.3948 -17.6964 0.0052 -0.0006
hfenergy: -908.922115 hartree
pointgroup: C01 [X(C7H9N3O1S1)]
dipole: 0.195851 -2.6418292 0.0003522 debye
dipolederiv: 0.0063141 0.1920389 0.0000289 0.100323 -0.1954084 -0.0000297 0.0000228 -0.0000418 0.1442257 -0.8011158 0.0779346 0.000004 0.4989348 -0.999776 -0.0000541 -0.0002688 0.0004612 -0.3678839 1.0346044 0.004016 -0.0001138 0.8282681 -0.2112743 -0.0000933 -0.0001675 -0.0000288 -0.0769918 -2.2609567 0.1977458 0.0000349 -0.0661397 -0.0968804 0.0002518 0.0000563 0.000071 -0.35278 -1.4820394 -0.4236057 0.0003599 -0.5667692 -0.5240636 -0.0003126 -0.0000665 -0.0004415 -0.7947927 0.0913166 0.1602212 -0.0000005 -0.0916556 0.1908964 0.000023 -0.0000717 0.0000263 -0.0369229 -0.2654061 -0.0202057 0.0000075 -0.0346107 0.2470848 0.0000399 0.0000112 0.0000287 -0.1678162 0.0533337 -0.0132837 -0.0000251 -0.1167627 -0.3191052 -0.0000013 -0.0000285 -0.000012 -0.1606291 0.1372043 -0.0031389 -0.000007 -0.0072591 -0.0614668 -0.0000109 0.0000269 -0.0000384 0.0954717 -0.1296106 -0.2736062 -0.0000469 -0.1712587 0.0319432 0.0000361 -0.0000328 0.0000444 -0.3152179 0.195272 0.0377291 -0.000046 0.4147789 0.3476939 -0.0000182 0.000097 0.0000249 -0.0909953 3.0469402 0.1154485 -0.000067 -0.7818282 1.4663368 -0.0000354 0.0004307 -0.0002941 0.3523347 -0.0862066 0.0400765 0.000032 0.0967093 0.0832869 -0.000015 0.0000357 -0.0000066 0.189897 0.0689028 -0.0608384 -0.0994425 0.0298065 -0.0171681 -0.0579632 -0.0449964 -0.1035759 -0.0435452 -0.1537094 0.1033123 -0.000009 0.0051623 0.0640949 -0.0000029 -0.0000127 0.0000019 0.1144905 0.0688697 -0.0608807 0.0994584 0.0297677 -0.0171725 0.0579509 0.0450069 0.1035753 -0.043491 0.0419589 -0.0572562 0.0000152 -0.0372565 0.0292315 -0.0000068 0.0000169 -0.0000037 0.2188537 0.0014312 -0.0698308 0.0000177 -0.0668719 -0.1948935 -0.0000237 0.0000266 -0.0000117 0.1827457 -0.0521674 0.0114434 0.0000182 -0.0874778 -0.0721201 -0.0000197 0.000124 -0.000058 0.3360895 0.2615588 0.0116843 -0.0000667 -0.0222791 0.1664549 0.0000992 -0.000087 0.0000821 0.4061677 0.2235052 0.0309956 -0.0001519 0.0464186 0.0823055 0.0001861 -0.0001231 0.0001966 0.41079 unknown
polarizability: 232.7866523|9.078638|128.6188547|-0.011118|-0.0028043|50.6831714 unknown
InChI: InChI=1S/C7H9N3OS/c1-5-2-3-12-6(5)4-9-10-7(8)11/h2-4,10H,8H2,1H3
charge 0 multiplicity 1
21 atoms
S  1.486619 1.758709 0.000051
O  -3.609956 1.33437 -0.000407
N  -1.096236 0.049752 0.000252
N  -2.291719 -0.634481 0.000386
N  -4.627993 -0.765785 0.000169
C  2.565722 -0.686791 -0.000207
C  1.316002 -0.046565 -0.000031
C  3.661483 0.250844 -0.000275
C  2.758372 -2.190643 -0.000328
C  3.268278 1.58056 -0.000151
C  0.013147 -0.668455 0.000069
C  -3.516983 0.082816 0.000402
H  4.709211 -0.061285 -0.000408
H  2.307951 -2.664785 -0.89267
H  3.832293 -2.441972 -0.000272
H  2.307818 -2.664953 0.891856
H  3.88889 2.474891 -0.000166
H  0.006942 -1.777681 -0.000001
H  -2.303655 -1.666187 0.000234
H  -5.539387 -0.315435 -0.000412
H  -4.580896 -1.78252 0.000808
