program: Gaussian 09
title: 000254442
version: EM64L-G09RevD.01
frameworkgroup: C1[X(C12H14O2)]
method: RPBEPBE
basis: SDD
operation: Freq
keyword: #pfreq=noraman
keyword: PBEPBE/SDD
title: #p freq=noraman PBEPBE/SDD
converged: YES YES NO NO
title: Mulliken charges:
elementType: O O C C C C C C C C C C C C H H H H H H H H H H H H H H
charge: -0.189325 -0.225372 -0.659728 -0.614508 0.226926 0.448495 0.265466 -0.470544 -0.402168 -0.374513 -0.679184 -0.239345 -0.226128 -0.241050 0.245953 0.250945 0.265281 0.242481 0.247641 0.236787 0.261827 0.259147 0.238563 0.214052 0.231724 0.229930 0.227230 0.229419
chargesum: 0.00000
title: Mulliken charges with hydrogens summed into heavy atoms:
elementType: O O C C C C C C C C C C C C
charge: -0.189325 -0.225372 -0.162830 -0.106746 0.226926 0.448495 0.265466 0.013884 -0.140341 -0.115367 0.005154 -0.009416 0.001102 -0.011631
polarizability: 1.35843087e+02 -1.04719293e+01 1.38559289e+02 1.57870658e+01 1.15220826e+01 1.07891393e+02
1716.lowfreq: -13.5981 -7.7999 0.0005 0.0007 0.0008 7.8962 16.6731 34.1943 39.2664
frequency: 13.7594 32.9325 39.1561 64.7644 71.4899 99.9723 134.5717 183.6142 224.0324 240.3713 295.4438 343.9803 389.8531 402.8163 454.4079 473.4567 479.3890 548.5493 573.5289 616.3110 658.5726 701.0993 739.9258 759.2427 784.9850 804.4776 847.4535 854.2368 906.2107 927.5382 957.4644 979.0399 989.0663 996.4205 1000.9756 1023.5282 1027.9795 1062.4881 1081.4267 1098.7572 1113.4070 1172.4554 1180.3786 1191.0978 1196.3166 1217.1652 1237.5521 1258.2968 1287.5150 1335.0587 1339.5132 1382.4140 1396.1659 1425.1471 1436.5945 1441.8751 1454.9893 1469.5549 1480.5117 1482.4391 1592.0888 1603.8766 1612.6582 1639.2998 2963.0454 2997.1981 3007.5367 3009.7796 3011.9262 3088.1189 3093.9915 3097.9512 3100.4907 3123.1841 3129.7666 3141.3078 3149.9484 3164.5080
redmass: 4.5394 3.9130 3.9175 3.1898 2.5006 6.0808 4.2721 1.2290 3.7347 3.6497 4.1903 2.9019 2.3475 2.8223 3.3318 4.6268 3.3748 2.6401 3.3351 6.2559 3.8758 2.0330 1.6796 2.2312 2.0243 3.7482 2.6002 1.2471 2.0109 1.5576 2.0137 1.3881 5.3956 1.3485 2.0771 1.6516 2.2370 1.7019 1.7089 2.0104 2.0529 1.0672 1.3561 1.3596 2.0835 1.4027 1.3793 1.2734 1.4845 1.3107 1.8356 7.7432 1.2078 1.0963 1.1128 2.0459 1.1231 1.0402 1.0528 2.1427 6.1944 6.9490 7.0665 8.1786 1.0619 1.0362 1.0906 1.0628 1.0615 1.1021 1.1006 1.1031 1.1001 1.0847 1.0880 1.0927 1.0966 1.1017
irintensity: 1.2769 2.8700 2.2657 0.1178 4.9872 3.8193 4.0112 0.5884 0.8555 6.2101 2.4425 1.0575 4.8989 0.0964 2.3329 2.2709 13.0435 26.9268 6.1947 0.0725 4.5299 42.1847 52.1326 2.2264 12.0193 1.0461 4.9551 0.9912 30.9372 6.3445 7.1514 0.7065 0.6867 0.0552 11.5736 13.0257 12.6107 29.6978 3.4872 14.3450 152.0387 2.5080 22.4040 0.9968 1.9420 50.8921 12.6050 15.7390 56.5095 7.3757 29.8329 2.3897 21.2106 36.2391 19.5823 7.5316 24.2372 9.7013 9.5789 22.4566 11.5167 127.7166 107.6783 14.5623 15.8411 21.7878 5.3362 5.6622 11.1514 4.3543 26.3097 11.5411 22.8482 0.6973 2.7570 15.5606 24.7132 19.1877
temp: 298.150 k
press: 1.00000 atm
elementType: 8 8 6 6 6 6 6 6 6 6 6 6 6 6 1 1 1 1 1 1 1 1 1 1 1 1 1 1
symmnumber: 1
zpe: 597585.0 jmol-1
zpe.correction: 0.227608 hartree
zpe.thermalcorrener: 0.241780 hartree
zpe.thermalcorrenthalpy: 0.242724 hartree
zpe.thermalcorrgfe: 0.183607 hartree
zpe.sumelectzpe: -615.084043 hartree
zpe.sumelectthermal: -615.069871 hartree
zpe.sumelectthermalent: -615.068927 hartree
zpe.sumelectthermalfe: -615.128044 hartree
dipole: 0.5429 0.7977 -0.5187
dipole: 1.0955
quadrupole: -76.0705 -84.7434 -86.0195
quadrupole: -3.0608 -0.8492 -7.4255
quadrupole: 6.2073 -2.4656 -3.7417 -3.0608 -0.8492 -7.4255
hfenergy: -615.3116508 hartree
pointgroup: C01 [X(C12H14O2)]
dipole: 0.3157853 0.2028957 -0.2118457 debye
polarizability: 125.9796589|-4.6842147|145.0506191|21.6909154|-0.6631144|111.2634902 unknown
InChI: InChI=1S/C12H14O2/c1-2-11(13)9-12(14)8-10-6-4-3-5-7-10/h3-7H,2,8-9H2,1H3
charge 0 multiplicity 1
28 atoms
O  0.338924 -3.153362 -0.280857
O  2.373991 0.219903 1.789929
C  -0.354519 -1.615618 1.490156
C  2.170395 -2.028677 0.872606
C  0.679878 -2.341954 0.61645
C  -1.054577 -0.502529 0.700656
C  2.472348 -0.521448 0.776219
C  2.863258 -0.000533 -0.603184
C  -0.836295 0.860458 1.024446
C  -1.932415 -0.827178 -0.366355
C  2.924158 1.532832 -0.698622
C  -1.497593 1.881893 0.303797
C  -2.589395 0.194014 -1.087491
C  -2.376603 1.552522 -0.753228
H  0.131129 -1.197004 2.386589
H  -1.09867 -2.370764 1.80447
H  2.41277 -2.353473 1.90188
H  2.763332 -2.605554 0.143678
H  2.151637 -0.423611 -1.342121
H  3.845538 -0.452467 -0.859699
H  -0.14554 1.121013 1.834668
H  -2.091358 -1.878783 -0.630797
H  1.932105 1.974386 -0.500045
H  3.250229 1.84636 -1.705861
H  3.625728 1.947212 0.045159
H  -1.326298 2.931189 0.569516
H  -3.268517 -0.069264 -1.906269
H  -2.89004 2.344141 -1.310492
