program: Gaussian 09
title: 000254446
version: EM64L-G09RevD.01
frameworkgroup: C1[X(C12H22O3)]
method: RPBEPBE
basis: SDD
operation: Freq
keyword: #pfreq=noraman
keyword: PBEPBE/SDD
title: #p freq=noraman PBEPBE/SDD
converged: NO YES NO NO
title: Mulliken charges:
elementType: O O O C C C C C C C C C C C C H H H H H H H H H H H H H H H H H H H H H H
charge: -0.455913 -0.508416 -0.223738 -0.073463 -0.120323 -0.113322 -0.436909 -0.408179 -0.556478 -0.354760 -0.709863 0.162812 -0.703924 -0.147645 -0.520592 0.246795 0.219658 0.239742 0.243219 0.195710 0.197635 0.193386 0.217080 0.249357 0.234311 0.187475 0.213682 0.219326 0.224676 0.358553 0.355823 0.218783 0.204113 0.207451 0.269501 0.224936 0.249503
chargesum: 0.00000
title: Mulliken charges with hydrogens summed into heavy atoms:
elementType: O O O C C C C C C C C C C C C
charge: -0.097359 -0.152593 -0.223738 0.173331 0.099335 0.126420 0.002019 -0.017159 -0.090040 0.067026 -0.052180 0.162812 -0.073576 0.121856 -0.046153
polarizability: 1.62107294e+02 9.62742984e-01 1.33299451e+02 1.31511323e+01 -4.95951576e+00 1.23699748e+02
1716.lowfreq: -16.0562 -5.9216 -0.0009 -0.0008 -0.0005 11.4135 32.3889 35.8764 42.2065
frequency: 32.3529 35.8514 42.0843 50.5140 81.6833 89.9202 95.8502 128.7621 149.8342 155.4490 196.2802 215.6713 225.9189 242.5592 263.7937 272.9610 297.8649 318.6320 332.6621 352.1709 392.1879 420.6140 447.0042 462.0550 507.2820 524.4647 588.9792 615.7818 633.2564 740.5088 744.8065 762.3065 783.6301 824.0529 856.0906 868.8352 899.4620 915.8144 928.2310 977.6891 1000.1048 1004.9108 1013.0614 1026.9829 1032.5397 1058.7561 1064.7856 1070.2585 1090.7609 1104.5858 1113.5895 1140.3343 1146.9142 1186.8170 1204.7692 1220.1672 1252.3908 1261.2453 1265.3137 1278.2153 1293.4500 1300.0128 1303.7102 1321.0310 1336.9059 1346.3158 1350.7026 1354.8332 1385.1521 1388.1619 1394.1320 1411.1086 1421.7346 1444.6483 1451.8318 1475.2589 1476.2246 1479.1702 1483.1516 1486.5018 1491.8920 1570.3528 1639.1127 2947.9082 2955.9866 2965.9919 2967.0706 2973.0686 2973.6284 2981.5422 2983.9389 3001.3203 3031.8385 3034.0989 3039.0498 3066.6766 3067.9303 3068.6496 3075.2831 3081.6639 3095.3362 3138.8670 3210.8870 3418.9280 3574.0571
redmass: 4.7562 4.6281 3.7844 3.5710 1.8239 2.8393 2.4202 3.0038 3.2411 2.4724 3.1015 2.4188 1.2793 2.4851 2.4690 1.9448 1.2878 2.7068 2.7787 4.7283 4.2667 2.9037 1.8399 2.9069 2.5787 2.8565 2.8231 1.1876 1.9838 1.2904 2.1175 2.1485 1.9519 1.6853 2.2450 2.3213 1.7722 2.0193 2.0599 2.3519 2.3038 1.4415 2.3600 1.1853 1.8631 2.1177 1.7136 2.1794 1.7350 1.9227 1.8516 1.6426 2.4409 1.5647 1.6565 1.3820 1.2968 1.3092 1.3040 1.1798 1.4280 1.1540 1.2740 1.3093 1.3725 1.3197 1.4868 1.3948 1.2341 1.4370 1.2288 1.2483 1.1741 1.0884 1.0897 1.0490 1.0455 1.0440 1.0644 1.0825 1.0662 8.4012 4.5947 1.0631 1.0758 1.0650 1.0387 1.0692 1.0658 1.0364 1.0788 1.0949 1.0916 1.0946 1.0967 1.1011 1.0987 1.0932 1.0994 1.0997 1.0589 1.0955 1.1155 1.0649 1.0664
irintensity: 1.9522 4.0794 0.2625 2.1006 0.1509 2.6139 1.0100 0.6664 1.3645 2.3213 1.0514 1.3515 0.3417 3.1234 0.7004 2.6957 97.7369 23.8190 1.9432 4.7641 2.3807 3.4986 0.6970 1.9833 10.3499 1.0164 13.6081 177.3085 19.0784 5.7280 4.1689 11.1143 9.9908 3.3964 28.6313 8.6654 3.9799 23.3206 19.7385 17.3950 50.4801 49.7088 18.9374 20.7638 15.9279 5.0678 9.0559 3.1569 3.0630 22.0820 31.5977 68.4201 18.3289 45.5476 35.5437 15.8200 3.2949 16.3066 2.3252 10.1450 12.3242 5.0992 8.8336 1.7538 2.2203 3.2931 6.8594 3.7214 9.1603 1.4778 20.0215 83.0998 58.9519 20.6816 1.9401 6.3110 9.4342 3.2987 5.0783 13.3118 18.9198 96.1030 34.1537 16.3606 16.5192 13.9777 47.9988 28.0132 14.1706 28.6123 70.2549 12.5987 27.9737 19.0772 21.7405 83.6201 56.4951 18.9179 39.9937 53.0822 6.1452 5.2360 6.0467 124.3557 8.3808
temp: 298.150 k
press: 1.00000 atm
elementType: 8 8 8 6 6 6 6 6 6 6 6 6 6 6 6 1 1 1 1 1 1 1 1 1 1 1 1 1 1 1 1 1 1 1 1 1 1
symmnumber: 1
zpe: 838997.9 jmol-1
zpe.correction: 0.319557 hartree
zpe.thermalcorrener: 0.338056 hartree
zpe.thermalcorrenthalpy: 0.339001 hartree
zpe.thermalcorrgfe: 0.272062 hartree
zpe.sumelectzpe: -694.884994 hartree
zpe.sumelectthermal: -694.866495 hartree
zpe.sumelectthermalent: -694.865551 hartree
zpe.sumelectthermalfe: -694.932490 hartree
dipole: -0.1046 -1.8086 -3.1319
dipole: 3.6181
quadrupole: -101.5780 -89.8555 -93.0141
quadrupole: -11.7358 6.9620 6.8505
quadrupole: -6.7621 4.9604 1.8018 -11.7358 6.9620 6.8505
hfenergy: -695.2045517 hartree
pointgroup: C01 [X(C12H22O3)]
dipole: -0.0033282 0.4450332 1.3520972 debye
polarizability: 162.4257432|-1.4656184|134.8549212|-12.8455488|-1.0680045|121.8258284 unknown
InChI: InChI=1S/C12H22O3/c1-4-7-11(14)10(6-3)12(15)8-9(13)5-2/h5,10-12,14-15H,2,4,6-8H2,1,3H3
charge 0 multiplicity 1
37 atoms
O  -1.135385 1.418674 -1.153823
O  0.478122 1.471582 1.008204
O  3.409601 -1.840337 0.478715
C  -0.118866 -0.620893 -0.125762
C  -1.424598 0.068167 -0.637177
C  0.38628 -0.007794 1.205912
C  -0.262058 -2.164502 0.025283
C  -2.583145 0.109367 0.389036
C  1.744868 -0.570094 1.712182
C  -3.910996 0.566805 -0.25483
C  -0.719074 -2.890658 -1.259849
C  2.857419 -0.714576 0.664677
C  -5.05155 0.734364 0.771068
C  3.269501 0.509069 -0.092784
C  4.34742 0.502981 -0.922914
H  0.647834 -0.421038 -0.904322
H  -1.768486 -0.481661 -1.531726
H  -0.363579 -0.199251 2.003275
H  0.716901 -2.584956 0.321929
H  -0.967967 -2.396071 0.849794
H  -2.322365 0.807311 1.211478
H  -2.722905 -0.893842 0.844541
H  2.107334 0.097561 2.522665
H  1.589074 -1.566337 2.161317
H  -3.728146 1.520315 -0.785378
H  -4.211838 -0.170059 -1.027883
H  -1.765535 -2.65932 -1.527114
H  -0.645395 -3.985444 -1.127512
H  -0.08041 -2.612796 -2.119055
H  -0.577634 1.858569 -0.451723
H  0.564693 1.91882 1.886419
H  -5.991177 1.049561 0.28077
H  -5.252589 -0.212816 1.307921
H  -4.794583 1.500354 1.527673
H  2.658624 1.407265 0.054269
H  4.653566 1.396171 -1.478489
H  4.936844 -0.413186 -1.053485
