program: Gaussian 09
title: 000254448
version: EM64L-G09RevD.01
frameworkgroup: C1[X(C14H24O3)]
method: RPBEPBE
basis: SDD
operation: Freq
keyword: #pfreq=noraman
keyword: PBEPBE/SDD
title: #p freq=noraman PBEPBE/SDD
converged: YES YES NO NO
title: Mulliken charges:
elementType: O O O C C C C C C C C C C C C C C H H H H H H H H H H H H H H H H H H H H H H H H
charge: -0.276725 -0.269030 -0.279243 0.311471 -0.267505 -0.392289 -0.736263 -0.749311 -0.263708 0.255447 0.360201 -0.793936 -0.791176 -0.312817 -0.251211 -0.205592 -0.676283 0.258989 0.265742 0.221173 0.213351 0.221355 0.263889 0.212967 0.206334 0.196297 0.221674 0.220009 0.236689 0.216997 0.218612 0.227486 0.237759 0.241962 0.223207 0.195626 0.187556 0.189820 0.230073 0.227934 0.202470
chargesum: 0.00000
title: Mulliken charges with hydrogens summed into heavy atoms:
elementType: O O O C C C C C C C C C C C C C C
charge: -0.276725 -0.269030 -0.279243 0.311471 -0.008516 -0.126547 -0.080384 -0.066121 -0.067412 0.255447 0.360201 -0.115565 -0.128081 0.166904 0.167622 0.171785 -0.015806
polarizability: 2.30436106e+02 -1.34820419e+01 1.56141888e+02 1.00497467e+00 -3.60529438e+00 1.34921347e+02
1716.lowfreq: -13.3960 -0.0006 -0.0002 0.0005 2.2737 5.8236 15.9158 19.9135 25.4148
frequency: 15.7950 19.1198 25.1949 31.4664 59.1062 74.7574 85.1285 103.4742 110.9597 119.2006 136.0650 148.1197 158.4247 169.9915 189.1085 227.3780 232.3001 243.7127 251.4669 279.6473 301.5940 332.4466 338.5589 358.4840 371.0949 416.0538 431.4578 457.3073 490.0512 508.1785 526.6260 622.1246 678.9758 729.2948 809.0126 812.0456 817.9062 826.6067 836.6617 860.5187 878.3573 888.2840 948.8048 954.9291 973.0803 986.4681 991.1364 1000.5203 1014.5220 1037.7722 1054.1199 1073.5620 1075.5436 1076.7331 1082.0850 1113.9539 1117.3416 1126.3123 1131.4373 1145.4241 1165.5847 1197.9217 1198.9750 1242.7813 1251.6209 1272.0754 1287.8411 1313.6161 1328.4111 1355.5949 1370.9495 1387.1635 1389.5844 1390.7600 1399.8766 1401.2048 1406.4824 1418.6993 1454.3165 1456.7820 1458.5392 1463.6538 1466.0131 1470.8724 1472.1347 1476.2774 1476.3595 1484.1067 1485.4478 1491.0167 1497.0529 1620.1405 1685.6218 2919.3964 2937.9725 2956.9540 2964.8393 2967.3826 2973.5324 2977.6469 2994.2189 2994.4624 3027.6841 3032.3781 3044.9964 3057.4178 3065.1149 3077.1837 3080.9473 3088.2409 3092.2318 3094.8114 3095.9024 3101.4885 3119.8025 3127.7283 3152.4636
redmass: 3.3537 2.7416 2.9196 2.7689 3.6219 2.9923 3.6459 1.6602 1.5261 2.7993 2.4413 2.9835 2.0192 1.2281 1.4919 1.9602 1.1701 2.8543 1.7740 2.6118 4.1053 3.3067 3.1135 3.2159 2.6028 2.5480 3.0300 2.5347 3.3435 2.8833 3.9860 4.2589 4.3501 5.2360 2.9376 1.3381 1.7066 1.8998 2.2206 1.6760 3.1794 3.7598 1.3961 1.4284 1.7214 1.9511 1.2546 3.4481 1.6257 1.7703 1.7478 3.8120 2.2844 1.8988 1.5466 1.7829 1.7992 1.8942 2.2995 1.5316 2.5517 1.2225 2.0559 2.4393 1.1443 1.1211 1.8233 1.2409 1.7060 1.3086 1.6240 1.2344 1.2448 1.3015 1.2284 1.2835 1.4469 2.1819 1.0497 1.0998 1.0410 1.0533 1.0543 1.0507 1.0470 1.0735 1.0738 1.1388 1.0666 1.0575 1.0794 8.9048 6.3390 1.0552 1.0555 1.0374 1.0388 1.1065 1.0368 1.0364 1.0979 1.0430 1.0969 1.0963 1.0578 1.0988 1.0989 1.0969 1.0969 1.0919 1.0990 1.0967 1.0986 1.1010 1.0878 1.1086 1.0891
irintensity: 0.2856 2.4860 0.6722 0.2121 1.3702 1.6300 1.7306 0.6379 0.2030 4.1155 0.0977 1.5814 1.8816 0.9394 0.4332 0.7304 0.4119 0.7578 2.0967 1.1392 18.8293 12.1162 2.5056 8.2897 1.7798 2.2492 2.4439 2.4463 11.8449 1.5524 6.8428 3.5492 7.2852 11.1965 19.7442 1.2911 7.6133 3.0319 3.4249 21.4580 14.3786 36.8068 2.3229 4.7939 6.2395 50.1759 2.9175 26.5577 17.4068 27.7588 43.7572 161.1407 99.0149 9.7557 6.0501 202.0830 147.7446 0.5546 33.0155 5.8088 53.5362 3.6387 65.1318 33.9972 0.2385 2.6120 52.5087 4.0680 14.9720 8.0220 90.6739 9.4706 25.8580 40.5368 10.0932 20.2379 8.2562 61.3685 1.7440 25.2796 10.6881 16.4704 4.1733 8.9114 21.7382 2.8729 13.1732 13.1813 1.0756 13.4284 5.4657 148.2897 6.3982 51.7731 68.3535 46.4751 62.2772 63.8134 29.2933 49.9723 38.3819 22.9603 10.2736 41.4203 28.9325 15.5206 47.9313 10.5844 30.9941 40.3839 35.9518 22.6837 12.8309 37.1640 11.4206 13.7168 4.5461
temp: 298.150 k
press: 1.00000 atm
elementType: 8 8 8 6 6 6 6 6 6 6 6 6 6 6 6 6 6 1 1 1 1 1 1 1 1 1 1 1 1 1 1 1 1 1 1 1 1 1 1 1 1
symmnumber: 1
zpe: 921471.9 jmol-1
zpe.correction: 0.350970 hartree
zpe.thermalcorrener: 0.372562 hartree
zpe.thermalcorrenthalpy: 0.373507 hartree
zpe.thermalcorrgfe: 0.297088 hartree
zpe.sumelectzpe: -772.147797 hartree
zpe.sumelectthermal: -772.126204 hartree
zpe.sumelectthermalent: -772.125260 hartree
zpe.sumelectthermalfe: -772.201679 hartree
dipole: 0.7857 1.7751 -0.8451
dipole: 2.1172
quadrupole: -88.4693 -101.5206 -106.6374
quadrupole: -7.6804 -0.4916 -0.5898
quadrupole: 10.4064 -2.6448 -7.7616 -7.6804 -0.4916 -0.5898
hfenergy: -772.4987667 hartree
pointgroup: C01 [X(C14H24O3)]
dipole: 0.2622904 0.479069 -0.6289146 debye
polarizability: 231.5330923|-9.8929804|148.2730681|2.4201886|-9.9878789|141.6931813 unknown
InChI: InChI=1S/C14H24O3/c1-6-16-7-8-17-13(15)12-11(9-10(2)3)14(12,4)5/h9,11-12H,6-8H2,1-5H3
charge 0 multiplicity 1
41 atoms
O  -1.199769 -0.64602 -0.691014
O  -0.522824 0.499206 1.234605
O  -4.745983 -0.57691 0.405386
C  1.584605 1.857348 -0.756282
C  2.259549 0.688419 -0.0215
C  0.89635 0.454435 -0.767555
C  2.137445 2.329802 -2.101033
C  0.995069 2.982726 0.091575
C  3.493592 0.01143 -0.49472
C  -0.299632 0.147102 0.047026
C  4.430182 -0.615213 0.279642
C  4.362257 -0.73983 1.791325
C  5.654995 -1.254815 -0.353613
C  -2.43969 -1.066633 0.016096
C  -3.519194 0.010285 -0.137557
C  -5.884632 0.352873 0.350939
C  -7.090637 -0.359615 0.96119
H  2.120475 0.727996 1.065012
H  0.938551 -0.086205 -1.717069
H  2.994419 3.012379 -1.946134
H  2.480139 1.49735 -2.739344
H  1.358936 2.881227 -2.660257
H  0.556084 2.602988 1.028668
H  1.787029 3.713198 0.343371
H  0.203618 3.520449 -0.465025
H  3.663437 0.022029 -1.581524
H  4.395086 -1.805771 2.092549
H  5.239504 -0.252911 2.262282
H  3.453505 -0.296641 2.228289
H  6.588147 -0.808019 0.044705
H  5.701158 -2.338051 -0.123003
H  5.661438 -1.137773 -1.451283
H  -2.749147 -1.998156 -0.481795
H  -2.220154 -1.247045 1.081707
H  -3.235844 0.925765 0.423816
H  -3.64885 0.271521 -1.21096
H  -6.082009 0.640524 -0.706329
H  -5.63866 1.27877 0.917398
H  -6.883085 -0.639298 2.008318
H  -7.322127 -1.279489 0.39697
H  -7.978632 0.298273 0.941428
