program: Gaussian 09
title: 000254445
version: EM64L-G09RevD.01
frameworkgroup: C1[X(C12H21ClO2)]
method: RPBEPBE
basis: SDD
operation: Freq
keyword: #p
keyword: freq=noraman
keyword: PBEPBE/SDD
title: #p freq=noraman PBEPBE/SDD
converged: YES YES NO NO
title: Mulliken charges:
elementType: Cl O O C C C C C C C C C C C C H H H H H H H H H H H H H H H H H H H H H
charge: -0.015792 -0.298739 -0.215126 -0.068955 -0.068908 -0.011466 -0.456688 -0.467935 -0.402601 -0.382234 -0.389402 -0.787530 -0.711424 0.358531 -0.708432 0.194690 0.277275 0.202548 0.213494 0.198618 0.207273 0.236473 0.202695 0.193384 0.203754 0.206463 0.193976 0.203334 0.209329 0.221454 0.243344 0.216729 0.210916 0.215115 0.288891 0.286944
chargesum: 0.00000
title: Mulliken charges with hydrogens summed into heavy atoms:
elementType: Cl O O C C C C C C C C C C C C
charge: -0.015792 -0.298739 -0.215126 0.125735 0.208367 0.191082 -0.044575 -0.024189 -0.006522 0.027983 0.007908 -0.113403 -0.068664 0.358531 -0.132596
polarizability: 1.63693859e+02 4.28631847e+00 1.38785331e+02 -6.26427285e+00 -7.29819022e-01 1.20431830e+02
1716.lowfreq: -7.6978 -6.0348 -3.4102 -0.0022 -0.0009 0.0007 16.7791 32.2955 45.1601
frequency: -7.2935 32.2351 45.1192 52.8217 58.7311 78.8231 104.5200 141.2883 177.4948 194.1221 216.1200 234.4383 249.4463 273.0042 296.9690 303.8931 328.6969 357.3087 407.2363 431.4940 456.3702 499.8914 536.2629 554.2470 619.1796 657.5859 726.2902 762.0820 782.1387 796.4033 825.5854 851.9810 856.3045 899.1404 905.8682 914.6058 917.2290 938.0171 961.5319 981.9382 1000.9858 1040.4713 1050.9145 1064.8659 1079.9692 1097.1749 1117.1984 1130.9091 1139.2524 1149.0426 1151.5280 1159.6836 1201.7310 1225.2592 1245.9243 1258.0270 1272.1803 1279.7473 1297.3419 1306.1341 1318.7453 1325.4401 1326.6868 1336.0388 1340.6527 1346.6001 1354.8835 1370.0447 1386.4926 1394.2665 1423.3202 1457.5695 1460.5854 1464.7244 1466.9886 1473.4785 1475.0569 1479.1047 1487.2734 1498.7699 1663.6461 2928.2985 2958.7350 2963.4895 2970.7965 2975.7344 2977.2961 2977.8446 2984.7094 2986.0578 3026.2288 3030.6253 3040.8262 3048.3845 3050.0085 3054.7050 3057.9572 3066.6810 3069.5730 3075.8019 3082.4002 3133.5429
redmass: 4.6260 4.2645 4.3902 1.9550 2.8176 3.5891 3.1218 4.9270 2.3023 2.5637 1.5737 1.6243 4.7239 3.1483 1.6390 2.6564 3.0726 2.4944 2.7078 2.4041 2.2697 2.9786 2.4599 3.3102 3.2428 5.6474 5.0806 1.3398 1.7767 2.8973 2.2561 2.0808 2.3295 1.9307 2.7217 1.8149 2.4200 2.3134 1.2626 1.9632 1.6384 2.0042 1.7051 2.0179 1.8979 1.5921 3.1519 1.5405 2.2187 1.1493 2.1552 1.8761 1.5064 1.3537 1.3303 1.2465 1.2183 1.4048 1.2875 1.2233 1.4979 1.3883 1.5596 1.5187 1.4405 1.4078 1.4320 1.4475 1.2221 1.1994 1.0876 1.0851 1.0856 1.0703 1.0804 1.0903 1.0445 1.0669 1.0538 1.0465 10.6066 1.0807 1.0724 1.0637 1.0625 1.0441 1.0527 1.0521 1.0634 1.0622 1.0968 1.0956 1.0975 1.0919 1.0952 1.1005 1.0574 1.0966 1.0988 1.0992 1.0980 1.1074
irintensity: 3.2418 0.0398 2.8478 0.1441 2.7913 1.1802 0.3388 1.7511 0.3682 1.8624 0.0328 0.4056 5.2283 1.6565 0.6686 1.5155 0.2704 0.3782 3.9960 1.3614 1.6921 1.3445 1.4971 5.4493 4.7335 3.9023 16.4499 6.7361 2.1238 19.6917 2.4292 29.7466 23.1308 3.8718 37.9543 7.6534 2.4292 48.9618 1.5317 11.8813 29.3105 13.5597 0.0458 16.3322 1.8740 29.7957 333.6890 0.1964 35.1195 14.0263 11.1204 3.0070 2.9347 0.5426 2.4572 1.4897 1.9110 26.6148 0.5097 1.0413 1.3963 0.8275 0.9769 0.3303 2.0613 4.2374 4.5756 2.2428 15.8908 15.0615 28.6674 9.4520 9.2450 0.8954 13.1171 7.0300 9.9669 2.1849 17.5196 16.8078 143.3374 10.7633 2.7738 42.1926 27.9534 34.9085 26.6372 35.1556 22.0187 41.7490 8.1584 75.0718 46.3696 14.7036 5.2302 92.9314 6.9226 22.5089 68.3696 65.7094 41.3216 1.9170
temp: 298.150 k
press: 1.00000 atm
elementType: 17 8 8 6 6 6 6 6 6 6 6 6 6 6 6 1 1 1 1 1 1 1 1 1 1 1 1 1 1 1 1 1 1 1 1 1
symmnumber: 1
zpe: 813489.5 jmol-1
zpe.correction: 0.309842 hartree
zpe.thermalcorrener: 0.326117 hartree
zpe.thermalcorrenthalpy: 0.327061 hartree
zpe.thermalcorrgfe: 0.264693 hartree
zpe.sumelectzpe: -1079.179273 hartree
zpe.sumelectthermal: -1079.162998 hartree
zpe.sumelectthermalent: -1079.162053 hartree
zpe.sumelectthermalfe: -1079.224422 hartree
dipole: 3.8048 1.1354 -1.7129
dipole: 4.3243
quadrupole: -111.9603 -96.8837 -100.5461
quadrupole: -2.4192 7.3851 1.5987
quadrupole: -8.8303 6.2463 2.5840 -2.4192 7.3851 1.5987
hfenergy: -1079.4891147 hartree
pointgroup: C01 [X(C12H21Cl1O2)]
dipole: 1.2953527 -0.9448224 0.5691049 debye
polarizability: 159.0559462|-11.1950309|143.6530265|4.6291616|0.256761|120.2020477 unknown
InChI: InChI=1S/C12H21ClO2/c1-3-9(2)10-6-4-5-7-11(10)15-12(14)8-13/h9-11H,3-8H2,1-2H3
charge 0 multiplicity 1
36 atoms
Cl -4.211761 2.473385 0.823629
O  -0.979389 0.129032 0.250749
O  -2.376263 1.186548 -1.303162
C  1.276916 -0.641267 -0.32833
C  -0.16496 -0.503463 -0.863738
C  1.938239 0.722505 0.065543
C  1.311177 -1.679647 0.829226
C  -0.813697 -1.848834 -1.238037
C  0.705642 -3.042515 0.416872
C  -0.745817 -2.878386 -0.088703
C  3.480135 0.558658 0.216741
C  1.621915 1.856421 -0.94114
C  4.179447 1.733527 0.936391
C  -2.046608 0.937913 -0.127934
C  -2.694136 1.454863 1.155471
H  1.859079 -1.058283 -1.182788
H  -0.219465 0.186197 -1.724011
H  1.525781 1.014753 1.054799
H  0.740694 -1.269219 1.686282
H  2.350236 -1.827701 1.175939
H  -0.269029 -2.241463 -2.121412
H  -1.856609 -1.673318 -1.561055
H  0.734605 -3.742248 1.274266
H  1.325853 -3.494122 -0.385644
H  -1.151071 -3.849302 -0.431674
H  -1.386785 -2.535943 0.747214
H  3.921222 0.426742 -0.79392
H  3.704119 -0.369528 0.776232
H  1.935154 1.577014 -1.96646
H  2.160942 2.781177 -0.669639
H  0.547624 2.108889 -0.971747
H  5.259909 1.533671 1.059323
H  3.749515 1.889956 1.943985
H  4.081418 2.681667 0.377759
H  -1.98417 2.093288 1.703003
H  -2.994265 0.611033 1.794069
