program: Gaussian 09
title: 000254447
version: EM64L-G09RevD.01
frameworkgroup: C1[X(C13H22O3)]
method: RPBEPBE
basis: SDD
operation: Freq
keyword: #pfreq=noraman
keyword: PBEPBE/SDD
title: #p freq=noraman PBEPBE/SDD
converged: NO YES NO NO
title: Mulliken charges:
elementType: O O O C C C C C C C C C C C C C H H H H H H H H H H H H H H H H H H H H H H
charge: -0.276026 -0.270040 -0.277916 0.310725 -0.267936 -0.390343 -0.749341 -0.735874 -0.263751 0.256811 0.360442 -0.791194 -0.793822 -0.304844 -0.260301 -0.496177 0.259256 0.265708 0.263115 0.213400 0.206360 0.221254 0.213399 0.221292 0.195976 0.216985 0.218698 0.227467 0.222024 0.219699 0.236599 0.239158 0.241700 0.197975 0.227303 0.205568 0.234637 0.202014
chargesum: 0.00000
title: Mulliken charges with hydrogens summed into heavy atoms:
elementType: O O O C C C C C C C C C C C C C
charge: -0.276026 -0.270040 -0.277916 0.310725 -0.008679 -0.124635 -0.066466 -0.079929 -0.067775 0.256811 0.360442 -0.128043 -0.115500 0.176014 0.164978 0.146041
polarizability: 2.12644546e+02 -1.26574117e+01 1.45335522e+02 1.28882225e+00 -3.67173335e+00 1.25888093e+02
1716.lowfreq: -11.7304 -0.0009 0.0001 0.0006 0.5550 5.0698 17.5071 20.3241 31.1670
frequency: 17.1781 19.3559 31.0319 57.9026 65.7071 79.1754 92.4931 109.0136 116.3191 140.8695 155.5983 170.3565 178.9814 205.8969 221.1080 227.6392 244.8976 250.6603 279.5791 303.2036 335.9420 353.8810 374.8423 412.8011 422.4963 449.0368 479.6621 508.3603 519.1581 622.1099 679.7238 729.1143 809.6600 816.6328 827.7683 857.9860 866.9187 885.0919 903.1245 949.6601 954.4499 972.6963 986.3399 990.9670 1014.3792 1037.5263 1053.4065 1062.3507 1075.4010 1081.7707 1085.9135 1105.2907 1119.6068 1127.7701 1132.5073 1161.1809 1165.4351 1197.8079 1198.2801 1242.2295 1271.7360 1287.9114 1323.0008 1330.2397 1368.9659 1385.9704 1387.6912 1391.3997 1400.4747 1402.5214 1417.6647 1438.1880 1454.0922 1455.5926 1458.3793 1463.5572 1466.8501 1470.0326 1470.5106 1472.2971 1476.6165 1483.9154 1488.9248 1492.8222 1619.1092 1685.8980 2926.3844 2940.2686 2957.1403 2965.0244 2973.3664 2977.7150 2997.5789 3002.4470 3027.7401 3032.4471 3045.3759 3057.2083 3064.7724 3077.2161 3080.9879 3088.2181 3094.9256 3095.7532 3104.8363 3119.9031 3128.7285 3152.4134
redmass: 3.4763 3.0852 3.4361 2.2883 3.6340 3.6202 3.2892 1.6527 1.5471 2.1161 2.4333 1.1959 1.3174 2.2832 1.1978 1.8367 2.8648 2.6012 2.8197 4.0898 3.0034 3.1666 2.6264 2.7415 2.7586 2.5248 3.6358 2.8660 3.8753 4.2470 4.3581 5.1890 3.1909 2.1418 1.6055 1.8682 3.7050 3.2911 4.5531 1.3952 1.4257 1.7429 1.8921 1.2539 1.6486 1.7775 1.9063 3.5819 1.4155 1.5902 3.7692 1.3306 2.1305 1.9260 1.5332 1.5144 2.4817 1.2955 1.8918 2.4205 1.1193 1.8551 1.3822 1.5612 1.6222 1.3793 1.2398 1.2933 1.2461 1.2580 2.2040 1.1532 1.0498 1.0995 1.0514 1.0535 1.0530 1.0583 1.0505 1.0462 1.0837 1.1376 1.0597 1.0754 8.9256 6.3361 1.0361 1.0537 1.0374 1.0389 1.0368 1.0365 1.1050 1.1037 1.0969 1.0963 1.0579 1.0989 1.0988 1.0968 1.0968 1.0921 1.0968 1.0983 1.0974 1.0876 1.1086 1.0891
irintensity: 0.5115 2.1095 0.7627 2.9608 1.7569 3.2963 1.4413 1.2557 0.5403 0.2785 2.3741 0.9246 0.0586 4.5030 2.2845 2.2846 2.1132 1.7141 2.5202 17.3794 3.8803 5.5515 2.7665 5.5003 5.6902 1.3421 9.8184 0.9848 10.4885 3.2081 7.1266 10.8217 21.2320 1.0154 2.9980 23.1024 5.7136 43.7202 7.0084 2.3894 3.5013 6.9414 46.3332 2.8768 13.2657 20.6217 41.1007 119.9132 10.0052 12.1173 125.5706 7.8650 296.9215 19.2726 4.3079 4.7611 55.9665 0.1555 68.8386 30.7466 3.4177 49.6528 5.5058 15.6509 66.7371 15.7166 13.3858 36.7466 11.4551 18.4543 66.0817 0.2533 2.1114 24.9664 13.2041 14.7018 5.9907 14.1537 7.6872 22.3052 3.1229 13.6775 13.6988 4.5201 148.4257 6.3788 75.6003 57.6865 45.9413 61.8512 28.8034 49.6660 74.6950 37.6703 10.2547 41.5497 28.8816 14.3196 48.7828 10.2590 31.1068 40.1735 21.8087 14.7729 33.4016 11.1126 14.1308 4.4913
temp: 298.150 k
press: 1.00000 atm
elementType: 8 8 8 6 6 6 6 6 6 6 6 6 6 6 6 6 1 1 1 1 1 1 1 1 1 1 1 1 1 1 1 1 1 1 1 1 1 1
symmnumber: 1
zpe: 848218.5 jmol-1
zpe.correction: 0.323069 hartree
zpe.thermalcorrener: 0.343266 hartree
zpe.thermalcorrenthalpy: 0.344210 hartree
zpe.thermalcorrgfe: 0.271729 hartree
zpe.sumelectzpe: -732.918583 hartree
zpe.sumelectthermal: -732.898386 hartree
zpe.sumelectthermalent: -732.897442 hartree
zpe.sumelectthermalfe: -732.969924 hartree
dipole: 0.8454 1.9213 -0.7240
dipole: 2.2204
quadrupole: -83.5848 -96.0002 -100.2698
quadrupole: -8.7962 -1.0333 -0.4245
quadrupole: 9.7001 -2.7152 -6.9849 -8.7962 -1.0333 -0.4245
hfenergy: -733.2416526 hartree
pointgroup: C01 [X(C13H22O3)]
dipole: 0.2864269 0.6853147 -0.4598398 debye
polarizability: 213.8455523|-8.7194315|141.6368629|2.1578399|-7.1918016|128.3857461 unknown
InChI: InChI=1S/C13H22O3/c1-9(2)8-10-11(13(10,3)4)12(14)16-7-6-15-5/h8,10-11H,6-7H2,1-5H3
charge 0 multiplicity 1
38 atoms
O  -1.641036 -0.688442 -0.87454
O  -0.989635 -0.010253 1.267749
O  -5.163779 -1.023617 0.246424
C  1.031068 1.875021 -0.354894
C  1.764804 0.604778 0.103402
C  0.413087 0.477774 -0.6866
C  0.38344 2.74878 0.717098
C  1.55611 2.664548 -1.55404
C  3.027922 0.110558 -0.501734
C  -0.763507 -0.061097 0.030491
C  3.994686 -0.632569 0.11661
C  5.242384 -1.060886 -0.6385
C  3.939439 -1.096531 1.561206
C  -2.854667 -1.316002 -0.284928
C  -3.959904 -0.268504 -0.108565
C  -6.307909 -0.151224 0.500781
H  1.627564 0.391178 1.169768
H  0.476972 0.168072 -1.733366
H  -0.025017 2.145486 1.54434
H  1.132158 3.451156 1.129773
H  -0.442586 3.347776 0.288127
H  2.372251 3.342446 -1.239592
H  1.947054 2.015725 -2.356612
H  0.747777 3.282666 -1.987084
H  3.191796 0.373535 -1.557203
H  6.158164 -0.680728 -0.142872
H  5.332495 -2.165542 -0.661702
H  5.240304 -0.695991 -1.680366
H  4.004121 -2.201524 1.614858
H  4.805598 -0.703102 2.129945
H  3.021589 -0.789032 2.086802
H  -3.161357 -2.079376 -1.015956
H  -2.602802 -1.780331 0.683202
H  -4.112409 0.290604 -1.05793
H  -3.690443 0.44834 0.69529
H  -6.108994 0.544243 1.343817
H  -7.148487 -0.812654 0.762858
H  -6.573753 0.444321 -0.398957
