program: Gaussian 09
title: 000250365
version: EM64L-G09RevD.01
frameworkgroup: C1[X(C11H15N3O)]
method: RPBEPBE
basis: SDD
operation: Freq
keyword: #p
keyword: freq=noraman
keyword: PBEPBE/SDD
title: #p freq=noraman PBEPBE/SDD
converged: YES YES NO NO
title: Mulliken charges:
elementType: O N N N C C C C C C C C C C C H H H H H H H H H H H H H H H
charge: -0.321288 -0.180345 -0.133368 -0.659919 -0.372015 -0.420792 -0.416203 -0.390010 0.439726 0.277792 -0.362517 -0.374292 -0.229010 -0.228962 -0.269255 0.229139 0.223282 0.230631 0.221124 0.279607 0.220788 0.217066 0.229421 0.239195 0.220760 0.219220 0.217965 0.341587 0.325078 0.225595
chargesum: 0.00000
title: Mulliken charges with hydrogens summed into heavy atoms:
elementType: O N N N C C C C C C C C C C C
charge: -0.321288 -0.180345 -0.133368 0.006746 0.080406 0.030963 0.084192 0.056476 0.439726 0.277792 -0.123322 -0.153532 -0.009790 -0.010997 -0.043660
polarizability: 2.10319038e+02 2.37122399e+00 1.33976138e+02 -2.07026019e+00 5.03070664e+00 8.47149339e+01
1716.lowfreq: -12.8200 -2.8238 -0.0005 0.0003 0.0004 8.2629 20.8394 55.9503 69.2221
frequency: 20.4706 55.8293 69.2068 110.7548 136.3743 152.4314 202.1069 240.7526 244.2368 288.1437 322.2492 383.1775 412.4366 430.1102 430.6895 492.2382 508.7242 513.7608 516.1195 571.8510 610.5939 614.2313 690.4610 712.1873 714.3736 725.0916 752.2248 808.1756 860.7669 873.4693 920.0661 953.0401 961.6433 974.2685 975.9764 988.3946 1031.0455 1041.0806 1047.4976 1077.3902 1082.5455 1090.6966 1120.0267 1171.9527 1186.3684 1200.0913 1205.1737 1221.1910 1252.5681 1266.4751 1288.5508 1333.2104 1338.2196 1355.0274 1362.3812 1370.2418 1379.9738 1390.2209 1422.9641 1449.3612 1476.3242 1481.0628 1489.5328 1493.8487 1502.5657 1576.9658 1586.0901 1621.8929 1636.6978 2921.6057 2932.1616 2939.0336 2973.1105 2982.0039 3004.3343 3049.5889 3080.7350 3121.4890 3127.8196 3149.6000 3155.8836 3168.4518 3553.3531 3705.5263
redmass: 5.3943 4.7902 3.7501 3.4740 4.1609 3.0235 3.6083 3.8005 4.7773 2.5946 2.1155 1.2276 2.9516 3.8691 3.8743 2.9607 2.9176 1.1578 2.9893 6.0290 2.3610 5.5065 1.8055 3.8020 6.6629 3.6285 1.8920 1.2669 1.4818 1.5391 3.7485 1.3763 2.0137 1.3788 4.3457 2.4874 2.2114 2.2297 1.9645 1.9194 1.9569 1.6333 2.0069 1.0537 2.7912 1.1652 1.4797 1.1696 2.1648 1.3450 1.7330 1.3990 1.3494 1.6501 1.6020 1.4905 1.8973 3.4353 4.4168 2.5530 1.1360 1.1014 1.1762 1.1183 2.0016 5.9868 1.7367 5.9991 2.4921 1.0709 1.0583 1.0641 1.0707 1.1020 1.0978 1.0907 1.0941 1.0843 1.0883 1.0916 1.0941 1.1005 1.0448 1.1042
irintensity: 2.3756 8.1951 2.4335 3.7726 1.5164 11.3011 3.2954 5.8088 1.3396 5.8805 1.4693 154.7781 1.3831 6.1606 11.8559 9.9869 15.7491 115.4268 5.9073 5.5927 0.6615 0.5494 43.0612 5.8198 27.6947 1.1201 83.6553 0.0264 3.9466 4.3798 15.7095 0.1008 2.3247 0.3335 2.2372 66.9666 14.0999 7.7506 0.3832 15.9078 0.5248 4.4338 3.7276 0.5960 29.5593 4.5189 5.9576 78.3255 16.2420 16.2295 90.8211 1.8226 1.1229 54.5037 8.4266 5.8981 119.5062 7.0182 440.0528 0.1337 73.1134 27.3470 36.8603 19.6832 93.0153 14.1182 297.4304 168.2570 289.3917 68.2449 50.6574 37.4217 26.7938 70.6057 60.4775 21.6957 6.0405 10.2871 9.4325 37.7739 38.1182 7.5900 35.1496 38.8250
temp: 298.150 k
press: 1.00000 atm
elementType: 8 7 7 7 6 6 6 6 6 6 6 6 6 6 6 1 1 1 1 1 1 1 1 1 1 1 1 1 1 1
symmnumber: 1
zpe: 655856.0 jmol-1
zpe.correction: 0.249802 hartree
zpe.thermalcorrener: 0.263510 hartree
zpe.thermalcorrenthalpy: 0.264454 hartree
zpe.thermalcorrgfe: 0.208413 hartree
zpe.sumelectzpe: -666.536524 hartree
zpe.sumelectthermal: -666.522817 hartree
zpe.sumelectthermalent: -666.521873 hartree
zpe.sumelectthermalfe: -666.577914 hartree
dipole: 0.5311 3.5787 -0.8843
dipole: 3.7244
quadrupole: -102.1746 -81.9689 -90.6560
quadrupole: -15.6966 6.6796 0.0790
quadrupole: -10.5748 9.6310 0.9438 -15.6966 6.6796 0.0790
hfenergy: -666.7863266 hartree
pointgroup: C01[X(C11H15N3O1)]
dipole: 0.2129504 -1.4127925 0.3251215 debye
polarizability: 210.3490811|-2.3602765|133.8291438|0.1824467|5.7499552|84.8318851 unknown
InChI: InChI=1S/C11H15N3O/c12-11(15)14-8-6-13(7-9-14)10-4-2-1-3-5-10/h1-5H,6-9,12H2
charge 0 multiplicity 1
30 atoms
O  -4.473831 1.202244 -0.027522
N  0.372384 -0.043706 -0.149958
N  -2.515702 -0.083841 -0.12897
N  -4.450236 -0.900799 0.967692
C  -0.40734 1.215371 -0.140499
C  -0.360598 -1.287058 -0.429769
C  -1.780318 1.003797 -0.800274
C  -1.749861 -1.288117 0.244803
C  1.772149 -0.018793 -0.025579
C  -3.842994 0.134129 0.253219
C  2.437257 1.159833 0.439386
C  2.580106 -1.152125 -0.356307
C  3.839841 1.192198 0.571245
C  3.981542 -1.104875 -0.210466
C  4.629645 0.063115 0.253334
H  0.139916 1.994546 -0.708177
H  -0.548149 1.593597 0.894768
H  0.2027 -2.141915 -0.01683
H  -0.477312 -1.466647 -1.521669
H  -2.397323 1.914031 -0.719637
H  -1.650401 0.781878 -1.878737
H  -2.282343 -2.206979 -0.079445
H  -1.610913 -1.339332 1.346821
H  1.85797 2.0440 0.721649
H  2.124921 -2.06297 -0.758007
H  4.317849 2.109332 0.93537
H  4.572853 -1.988973 -0.477143
H  -5.417911 -0.746712 1.23835
H  -3.983084 -1.756711 1.253657
H  5.718784 0.093779 0.359494
