program: Gaussian 09
title: 000250364
version: EM64L-G09RevD.01
frameworkgroup: C1[X(C22H26O4)]
method: RPBEPBE
basis: SDD
operation: Freq
keyword: #pfreq=noraman
keyword: PBEPBE/SDD
title: #p freq=noraman PBEPBE/SDD
converged: YES YES NO NO
title: Mulliken charges:
elementType: O O O O C C C C C C C C C C C C C C C C C C C C C C H H H H H H H H H H H H H H H H H H H H H H H H H H
charge: -0.270738 -0.239099 -0.259539 -0.264529 0.365769 -0.237179 -0.249280 -0.501834 -0.529554 -0.479997 0.335210 -0.822000 -0.549637 0.044576 0.160365 -0.677882 0.297123 0.248824 0.116850 -0.418205 -0.559978 -0.387252 -0.505577 0.338267 -0.530215 -0.537039 0.221650 0.268274 0.192724 0.237286 0.209311 0.237553 0.256175 0.214497 0.251899 0.242516 0.216857 0.221799 0.229392 0.251879 0.248112 0.298091 0.237956 0.241547 0.238733 0.231761 0.243420 0.220885 0.219668 0.218025 0.218156 0.244382
chargesum: 0.00000
title: Mulliken charges with hydrogens summed into heavy atoms:
elementType: O O O O C C C C C C C C C C C C C C C C C C C C C C
charge: -0.270738 -0.239099 -0.259539 -0.264529 0.365769 -0.015528 0.018995 -0.071825 -0.082689 -0.009325 0.335210 -0.110728 -0.098446 0.044576 0.160365 -0.426004 0.297123 0.248824 0.116850 -0.170093 -0.261887 -0.149296 0.206464 0.338267 0.153758 0.143524
polarizability: 3.65903004e+02 -1.84399296e+01 2.77288981e+02 9.76996941e+00 4.24633502e+00 1.51631363e+02
1716.lowfreq: -8.0329 -5.0146 -0.0009 -0.0006 -0.0004 3.3247 26.8263 33.9386 41.2983
frequency: 26.8038 33.9316 41.2633 69.3889 72.5031 88.4423 96.6923 109.3999 115.6185 122.4445 145.6261 168.4270 177.1169 185.0777 199.3052 212.9389 221.0704 229.5281 231.9546 251.2405 255.4513 268.7638 291.2739 307.8465 315.9869 327.1591 351.4289 373.7055 396.7839 412.1707 423.9223 432.8046 475.1046 479.8529 522.3795 542.0714 547.1578 563.7612 588.7369 598.0199 639.6139 658.4525 675.3137 705.7773 709.6939 717.8520 732.0178 748.7398 785.7976 805.1300 815.7455 839.3740 860.5538 873.0150 879.0333 890.3232 912.1006 926.4385 930.6346 942.8038 950.5422 964.3356 976.9190 996.1107 1008.0662 1010.9541 1032.1825 1053.1554 1061.2588 1075.7495 1093.0160 1110.6127 1113.0967 1114.0596 1117.5492 1122.9838 1136.8159 1145.3821 1148.3623 1148.9304 1161.7055 1183.4185 1190.0400 1206.7783 1210.9472 1217.5331 1229.9728 1240.5149 1259.4759 1262.7846 1269.1150 1284.0500 1287.0100 1305.4848 1323.4525 1333.2419 1339.2168 1345.8039 1356.8799 1378.0838 1398.8215 1418.4041 1421.8127 1426.2113 1436.9441 1441.0401 1452.2896 1459.1716 1464.1410 1464.9169 1466.8794 1467.5254 1468.6809 1473.7992 1474.8498 1480.3883 1483.5507 1493.1038 1495.2276 1515.8731 1577.7748 1597.1691 1635.5687 1637.2608 2905.1665 2952.2309 2954.5185 2957.0387 2971.2049 2986.4767 2999.5421 3000.0518 3002.4926 3007.3115 3018.3839 3040.3316 3040.7067 3043.7635 3053.2417 3073.6065 3081.0734 3091.7295 3103.4606 3120.5923 3122.6054 3141.4601 3146.2595 3157.2714 3164.0356 3185.6195
redmass: 4.6034 4.8282 4.5888 3.6019 3.4391 3.1596 3.3515 1.2639 3.5602 2.9557 3.7904 2.2040 2.9044 3.3183 3.1465 3.8845 2.0529 1.6434 1.4378 1.6818 1.5497 2.7537 3.1789 3.0778 3.9336 4.2232 2.8656 3.8818 4.5836 4.4178 3.9683 3.5891 4.0833 5.1852 3.4558 4.3476 3.9595 2.9615 3.9571 4.9632 4.6130 3.4852 4.0315 4.8964 5.6459 5.2158 2.8750 2.7612 1.7555 2.7578 2.0270 1.9446 1.8161 2.3048 4.6173 2.7889 1.7222 2.8314 3.1534 1.4282 2.1925 3.3886 4.2005 2.2604 3.5788 2.2371 1.8578 2.9529 2.5995 2.8293 2.7163 1.2578 1.2683 1.2616 2.1392 3.2327 1.9600 1.4235 1.4612 1.5300 1.5560 1.4071 2.1118 1.6110 1.2952 1.3965 1.6358 1.5082 1.4127 1.9914 1.6071 1.3968 2.1320 1.5870 1.6398 1.4055 1.7933 1.6810 2.8960 3.5262 1.2082 3.3009 1.1920 5.5043 1.3147 1.3590 1.0505 1.2439 1.0527 1.0553 1.2780 1.0507 1.0923 1.0593 1.0756 1.1830 1.3889 1.0872 1.0838 3.8347 7.7600 6.8574 7.1653 9.0430 1.0809 1.0619 1.0333 1.0331 1.0664 1.0376 1.0926 1.0595 1.0302 1.0795 1.0661 1.1002 1.1038 1.1037 1.1026 1.0976 1.1034 1.0995 1.1044 1.0988 1.0993 1.0862 1.1047 1.0896 1.0958 1.0918
irintensity: 0.4354 0.3152 0.6203 8.0186 1.6326 2.3377 1.5161 0.4781 0.0743 0.8333 3.5538 0.2165 3.4486 1.8878 2.2281 0.3641 3.9244 1.3608 1.8777 1.5782 2.0786 0.7551 2.2856 6.5719 15.8751 0.2830 0.5507 5.3514 2.4685 5.1057 4.6046 1.4567 0.2043 0.2525 0.7689 13.0576 2.4304 3.6711 3.6260 3.5147 1.8602 7.5400 2.3983 2.2863 6.6302 5.8556 19.5584 7.6840 16.8790 10.5075 15.3368 2.2387 21.5653 13.4712 1.7585 1.2348 19.6827 6.2590 0.0594 0.2423 6.1081 2.4570 35.2370 5.6362 74.3922 14.2530 9.3000 18.5578 21.2990 86.5509 37.9945 0.2332 0.3098 0.1011 111.4426 158.1309 20.9725 13.1070 4.9150 19.7806 41.0560 18.3623 149.4963 6.6378 27.1854 10.6218 45.1418 11.2040 22.9111 94.5335 19.4800 14.0656 38.4675 16.3144 21.5749 10.9222 11.8423 26.9062 7.7160 47.5700 25.4760 22.9961 19.9384 10.5023 5.3905 7.0708 12.2263 49.0987 14.1992 19.0672 54.0958 13.1057 8.6852 64.8153 3.8452 6.1661 2.7590 10.5255 3.1368 77.3589 31.0682 137.3017 46.8201 171.3099 22.0189 27.8704 113.1455 50.8906 28.3510 20.4780 33.8888 24.6853 44.0284 22.4256 34.6264 28.0660 54.9761 48.3548 21.0573 24.9618 36.9935 22.1520 28.1521 30.2089 26.2389 6.3972 15.7886 13.9187 18.4485 3.4706
temp: 298.150 k
press: 1.00000 atm
elementType: 8 8 8 8 6 6 6 6 6 6 6 6 6 6 6 6 6 6 6 6 6 6 6 6 6 6 1 1 1 1 1 1 1 1 1 1 1 1 1 1 1 1 1 1 1 1 1 1 1 1 1 1
symmnumber: 1
zpe: 1130822.4 jmol-1
zpe.correction: 0.430707 hartree
zpe.thermalcorrener: 0.455574 hartree
zpe.thermalcorrenthalpy: 0.456518 hartree
zpe.thermalcorrgfe: 0.376444 hartree
zpe.sumelectzpe: -1152.903858 hartree
zpe.sumelectthermal: -1152.878992 hartree
zpe.sumelectthermalent: -1152.878047 hartree
zpe.sumelectthermalfe: -1152.958122 hartree
dipole: -0.2942 -1.5378 -1.2745
dipole: 2.0188
quadrupole: -151.8462 -124.8654 -159.7195
quadrupole: -2.0047 8.1619 -2.6876
quadrupole: -6.3692 20.6116 -14.2425 -2.0047 8.1619 -2.6876
hfenergy: -1153.3345656 hartree
pointgroup: C01 [X(C22H26O4)]
dipole: 0.1281723 0.6189658 -0.4809257 debye
polarizability: 365.4824174|-19.410837|277.984277|-8.8925394|-0.1984849|151.3566535 unknown
InChI: InChI=1S/C22H26O4/c1-22-10-9-15-14-6-5-13(24-2)11-17(14)20(25-3)12-16(15)18(22)7-8-19(22)21(23)26-4/h5-6,11-12,18-19H,7-10H2,1-4H3
charge 0 multiplicity 1
52 atoms
O  5.300264 1.511248 -0.395722
O  5.532832 -0.113884 1.253331
O  -3.166234 -2.722195 -0.035875
O  -6.113837 1.238454 0.260535
C  2.389251 0.175182 -0.120486
C  1.508988 -0.97469 -0.701317
C  3.813413 -0.370401 -0.519865
C  2.200927 -2.268121 -0.206755
C  1.948198 1.476166 -0.822092
C  3.726337 -1.911623 -0.258854
C  0.025908 -0.7442 -0.463589
C  2.266532 0.305606 1.419397
C  0.453922 1.788451 -0.522316
C  -0.470964 0.570966 -0.429937
C  4.955313 0.297349 0.220244
C  -0.858451 -1.865401 -0.331707
C  -1.893171 0.776845 -0.252857
C  -2.793118 -0.351985 -0.126998
C  -2.23171 -1.681581 -0.170553
C  -2.478053 2.083399 -0.190327
C  -4.19215 -0.149196 0.041482
C  -3.852862 2.278271 -0.022645
C  6.38243 2.27908 0.266715
C  -4.719602 1.146989 0.09251
C  -2.656562 -4.092423 -0.064725
C  -6.704768 2.575543 0.324188
H  1.66867 -0.94067 -1.804453
H  3.952776 -0.162465 -1.597922
H  1.964162 -3.143019 -0.838384
H  1.885617 -2.510339 0.824921
H  2.091434 1.35438 -1.915112
H  2.575374 2.333371 -0.513061
H  4.233029 -2.1600 0.689563
H  4.246158 -2.466068 -1.060316
H  1.212549 0.413521 1.72627
H  2.685295 -0.569742 1.944983
H  2.819099 1.195328 1.774811
H  0.081298 2.484486 -1.300443
H  0.385693 2.349989 0.433135
H  -0.429911 -2.871134 -0.359722
H  -1.833761 2.963652 -0.274072
H  -4.858758 -1.009122 0.133891
H  -4.251118 3.296675 0.018754
H  7.31674 1.692709 0.273946
H  6.102758 2.520334 1.306199
H  6.491205 3.190411 -0.337987
H  -3.542136 -4.73375 0.055268
H  -1.947033 -4.27466 0.766049
H  -2.160363 -4.315613 -1.029626
H  -6.531966 3.142173 -0.612084
H  -6.312378 3.153487 1.184085
H  -7.783461 2.40522 0.457128
