program: Gaussian 09
title: 000254427
version: EM64L-G09RevD.01
frameworkgroup: C1[X(C11H15N)]
method: RPBEPBE
basis: SDD
operation: Freq
keyword: #pfreq=noraman
keyword: PBEPBE/SDD
title: #p freq=noraman PBEPBE/SDD
converged: NO YES NO NO
title: Mulliken charges:
elementType: N C C C C C C C C C C C H H H H H H H H H H H H H H H
charge: -0.027060 -0.062492 -0.065890 -0.450110 -0.450514 -0.404297 -0.401438 -0.595104 -0.493216 0.396140 -0.352223 -0.298569 0.231917 0.229976 0.202073 0.193379 0.199340 0.191656 0.194767 0.203013 0.194470 0.202301 0.230774 0.238796 0.225178 0.227071 0.240061
chargesum: 0.00000
title: Mulliken charges with hydrogens summed into heavy atoms:
elementType: N C C C C C C C C C C C
charge: -0.027060 0.169425 0.164086 -0.054658 -0.059518 -0.006517 -0.004666 -0.125534 -0.040967 0.396140 -0.112162 -0.298569
polarizability: 1.51807201e+02 1.22547485e+01 1.18200658e+02 -1.09276802e+00 -2.13891875e+00 8.14310265e+01
1716.lowfreq: -24.1401 -12.3448 -0.0007 -0.0004 0.0006 15.8341 55.9724 118.1431 127.6348
frequency: 55.1365 118.1403 127.6206 165.9357 198.2163 297.5328 310.6774 323.2611 337.2258 366.5134 411.2095 446.8945 495.2008 509.2912 549.1215 587.2338 620.0966 739.4405 802.9232 823.3080 836.2893 858.3351 873.5186 908.8094 933.6245 947.9905 962.4167 1012.8767 1043.2895 1055.8836 1082.0166 1098.5905 1111.5777 1117.1947 1118.9756 1157.9073 1168.2032 1189.5776 1213.2791 1252.4377 1271.8038 1277.2105 1283.1386 1308.1179 1314.8618 1329.9784 1333.4776 1339.9481 1344.2997 1347.8067 1354.3750 1363.3065 1444.5034 1454.5202 1462.9210 1463.5372 1468.2363 1474.4267 1649.3113 2159.7867 2934.0103 2938.1385 2946.7396 2955.2329 2958.0844 2965.9293 2967.1747 2968.4018 2999.6166 3016.8786 3018.9320 3025.5617 3030.4354 3040.5763 3122.3073
redmass: 4.0567 2.4865 7.3577 2.6116 2.3187 3.8191 1.8300 1.9669 4.3480 2.9694 4.0863 2.7922 3.2966 2.2118 3.6668 3.6330 3.8871 2.2932 1.7096 2.3715 1.5732 2.5379 1.4136 2.4268 1.4462 1.6097 2.3062 2.5861 2.0671 1.3611 2.5591 1.6982 1.8836 2.3487 1.7192 1.6969 1.7541 1.4547 1.4786 1.2182 1.3467 1.2970 1.2407 1.2754 1.2983 1.3928 1.4355 1.4281 1.5542 1.6496 2.0257 1.5303 1.0942 1.0873 1.0913 1.0919 1.0807 1.0958 6.6555 12.6294 1.0780 1.0701 1.0721 1.0622 1.0680 1.0664 1.0649 1.0625 1.0935 1.0974 1.0989 1.0973 1.0965 1.1034 1.0919
irintensity: 2.6840 0.0824 3.9004 0.4305 0.0759 0.2465 0.2328 0.9476 0.3486 0.0851 0.2719 0.3378 0.4240 0.8501 5.7905 3.4754 0.1013 1.0127 4.6653 4.4779 11.4403 2.7503 12.5857 1.3656 3.9301 5.7591 0.8917 13.8676 2.9998 0.3719 2.1088 1.1061 1.2352 2.9326 1.8817 1.0763 7.2871 3.0254 0.4571 2.0387 0.2672 0.6080 4.1144 1.1090 2.2413 1.6543 0.2305 0.9428 0.4825 1.1756 1.9529 0.0888 10.9768 4.9689 9.4826 6.7486 23.7105 4.5305 16.2429 40.7152 2.6333 12.6729 7.5540 1.0001 33.4173 85.6377 32.4713 31.5829 12.0305 66.4443 15.0758 50.0013 65.8829 101.5969 17.1527
temp: 298.150 k
press: 1.00000 atm
elementType: 7 6 6 6 6 6 6 6 6 6 6 6 1 1 1 1 1 1 1 1 1 1 1 1 1 1 1
symmnumber: 1
zpe: 613453.2 jmol-1
zpe.correction: 0.233652 hartree
zpe.thermalcorrener: 0.244421 hartree
zpe.thermalcorrenthalpy: 0.245365 hartree
zpe.thermalcorrgfe: 0.197388 hartree
zpe.sumelectzpe: -481.998283 hartree
zpe.sumelectthermal: -481.987515 hartree
zpe.sumelectthermalent: -481.986571 hartree
zpe.sumelectthermalfe: -482.034547 hartree
dipole: 5.0482 1.4815 -0.1434
dipole: 5.2630
quadrupole: -99.0666 -69.1925 -72.1365
quadrupole: -6.1832 0.6600 -0.1101
quadrupole: -18.9348 10.9394 7.9954 -6.1832 0.6600 -0.1101
hfenergy: -482.2319354 hartree
pointgroup: C01 [X(C11H15N1)]
dipole: -1.9883735 0.5748711 0.0581705 debye
polarizability: 151.9026424|-12.1213964|118.0740805|-1.1012712|2.394007|81.4621624 unknown
InChI: InChI=1S/C11H15N/c12-8-9-5-6-10-3-1-2-4-11(10)7-9/h5,10-11H,1-4,6-7H2
charge 0 multiplicity 1
27 atoms
N  4.395461 -0.73041 -0.073157
C  -0.582028 -0.585923 0.312398
C  -0.915069 0.801559 -0.302058
C  -1.648374 -1.641322 -0.071317
C  -2.356288 1.241921 0.052557
C  -3.078862 -1.188104 0.297402
C  -3.407294 0.180413 -0.345025
C  0.82856 -1.056894 -0.113495
C  0.117606 1.86194 0.152485
C  1.876563 0.047721 0.000622
C  1.545001 1.369268 0.127592
C  3.258491 -0.354212 -0.037395
H  -0.589524 -0.467368 1.418841
H  -0.843876 0.699046 -1.407601
H  -1.412043 -2.606769 0.418993
H  -1.595989 -1.819817 -1.166627
H  -2.582049 2.210497 -0.437125
H  -2.416601 1.417909 1.148059
H  -3.166687 -1.103897 1.400455
H  -3.813726 -1.950589 -0.025055
H  -3.422297 0.071395 -1.449336
H  -4.418199 0.515416 -0.042671
H  0.801912 -1.42144 -1.162009
H  1.139166 -1.923966 0.501069
H  -0.124234 2.197113 1.18592
H  0.033326 2.771969 -0.475791
H  2.346254 2.114243 0.221469
