program: Gaussian 09
title: 000250362
version: EM64L-G09RevD.01
frameworkgroup: C1[X(C12H16N6S)]
method: RPBEPBE
basis: SDD
operation: Freq
keyword: #p
keyword: freq=noraman
keyword: PBEPBE/SDD
title: #p freq=noraman PBEPBE/SDD
converged: NO YES NO NO
title: Mulliken charges:
elementType: S N N N N N N C C C C C C C C C C C C H H H H H H H H H H H H H H H H
charge: 0.479153 -0.142743 -0.113961 -0.114947 -0.016676 -0.425462 -0.389325 -0.338485 -0.361027 -0.459283 -0.453068 -0.353646 -0.354174 -0.452927 -0.452285 0.239788 0.000044 -0.097244 0.036212 0.265968 0.237510 0.254943 0.233961 0.225270 0.233721 0.225548 0.231208 0.258788 0.233662 0.245829 0.222738 0.221348 0.229971 0.222706 0.226886
chargesum: 0.00000
title: Mulliken charges with hydrogens summed into heavy atoms:
elementType: S N N N N N N C C C C C C C C C C C C
charge: 0.479153 -0.142743 -0.113961 -0.114947 -0.016676 -0.425462 -0.389325 0.164992 0.127877 -0.000291 0.003687 0.138804 0.114393 -0.001608 -0.002693 0.239788 0.000044 -0.097244 0.036212
polarizability: 2.73911268e+02 1.94346344e+01 2.43409420e+02 -6.91282676e-02 1.10237910e-01 1.04217633e+02
1716.lowfreq: -0.0020 -0.0012 -0.0010 3.3073 4.3406 7.8381 43.8160 52.2835 71.1739
frequency: 43.7934 52.2764 71.1661 80.1866 89.2971 105.5028 138.3834 151.0541 202.4914 224.0567 235.2742 244.8931 265.7031 275.7195 285.5317 311.9547 326.3598 383.7922 470.7385 491.7877 541.3291 567.1246 569.3622 607.1257 648.6847 653.6076 697.2316 702.9876 708.8325 718.2770 773.8527 790.7501 795.7234 840.5931 853.6325 861.9137 863.9135 906.7638 912.0703 915.4829 915.6929 923.0150 967.7035 976.3364 1038.0468 1056.9352 1073.7498 1105.6162 1116.7611 1127.8837 1152.6525 1159.2624 1166.6756 1172.7451 1179.9366 1191.2792 1212.1499 1217.5816 1236.9927 1240.9423 1250.7339 1299.1520 1303.7011 1309.9132 1313.0328 1318.5112 1325.2859 1332.3227 1336.2299 1361.5660 1378.7009 1399.8749 1468.1717 1469.5660 1470.5668 1473.1068 1478.6185 1487.0715 1490.1709 1494.1094 1500.7703 1526.8948 1564.0314 2974.5672 2986.5971 2988.7293 2997.5301 3008.2607 3008.8549 3010.6457 3011.8562 3063.3702 3065.5044 3067.8120 3078.1471 3079.7353 3083.7330 3091.5381 3096.0970
redmass: 3.5669 3.3110 2.9040 3.0624 3.6595 4.4057 4.2124 4.3890 5.0587 2.7273 1.6636 2.0878 5.0713 4.2414 5.2928 11.4622 6.2927 6.8005 12.4268 11.2748 9.8539 1.8589 1.8827 9.2818 10.8456 5.5347 13.4796 10.5716 5.8750 2.9102 5.4455 11.8311 2.7316 1.7346 2.2842 1.9218 1.9343 2.7664 2.0654 1.3977 2.2946 2.1414 1.8470 1.8723 3.1064 2.0186 2.1218 1.6795 1.6774 3.0507 2.1153 1.5637 1.5353 1.6478 2.0590 2.8317 1.2972 1.3069 1.4560 1.3256 5.1235 1.3407 1.3412 1.2446 1.2530 1.7158 1.6410 1.6239 1.5611 5.0153 6.2556 8.9675 1.0883 1.1017 1.1106 1.0958 1.0939 1.2289 1.1118 1.2010 3.5280 6.7113 11.2446 1.0679 1.0666 1.0675 1.0678 1.0660 1.0612 1.0671 1.0604 1.0953 1.0963 1.0958 1.1006 1.0968 1.1002 1.1052 1.1049
irintensity: 1.6443 0.0151 0.0585 0.4652 0.7666 1.4277 1.8372 1.4767 0.4821 0.0829 0.2401 0.0718 2.5070 5.2147 2.4685 0.9985 2.6142 9.6982 17.4814 0.5593 1.5408 1.7298 2.6323 4.4950 0.7641 0.5823 53.4514 6.1092 3.2484 2.3717 1.2513 4.8693 0.7613 3.9129 15.5509 2.4172 3.5212 0.8513 11.1526 2.7033 8.3291 2.7029 10.3766 4.7869 1.2505 3.5215 3.1111 6.7503 8.1983 0.7204 6.0143 2.7762 3.3684 2.0776 7.6784 22.3820 27.2327 12.7523 5.6697 3.7541 0.4294 6.3110 3.5309 0.9551 2.5796 12.7628 67.2091 20.7193 21.9338 123.4624 49.2339 14.4223 10.0386 43.3883 80.8227 51.6072 1.5105 59.9026 2.8539 131.1767 133.5699 1218.9663 231.9034 48.4833 26.2897 24.1156 14.5120 38.5853 33.6637 32.7162 31.9761 25.0498 15.5876 14.1528 38.1058 17.7817 19.0170 62.1550 54.6150
temp: 298.150 k
press: 1.00000 atm
elementType: 16 7 7 7 7 7 7 6 6 6 6 6 6 6 6 6 6 6 6 1 1 1 1 1 1 1 1 1 1 1 1 1 1 1 1
symmnumber: 1
zpe: 733168.8 jmol-1
zpe.correction: 0.279249 hartree
zpe.thermalcorrener: 0.295908 hartree
zpe.thermalcorrenthalpy: 0.296853 hartree
zpe.thermalcorrgfe: 0.234100 hartree
zpe.sumelectzpe: -1192.020930 hartree
zpe.sumelectthermal: -1192.004271 hartree
zpe.sumelectthermalent: -1192.003326 hartree
zpe.sumelectthermalfe: -1192.066079 hartree
dipole: 0.1274 -6.7554 -0.0127
dipole: 6.7566
quadrupole: -98.2361 -124.5148 -117.7610
quadrupole: -1.9263 0.1433 -0.0876
quadrupole: 15.2678 -11.0108 -4.2570 -1.9263 0.1433 -0.0876
hfenergy: -1192.3001788 hartree
pointgroup: C01 [X(C12H16N6S1)]
dipole: 0.4403635 2.6215382 -0.0029057 debye
polarizability: 267.5985374|-23.0300085|249.7212919|0.2000487|-0.3534483|104.2184913 unknown
InChI: InChI=1S/C12H16N6S/c1-2-6-17(5-1)11-9-10(16-19-15-9)13-12(14-11)18-7-3-4-8-18/h1-8H2
charge 0 multiplicity 1
35 atoms
S  1.822594 -3.808454 0.026269
N  2.092391 0.925818 0.009193
N  -2.549117 0.429364 -0.002052
N  -0.221986 0.637968 0.00201
N  -1.349143 -1.570404 -0.010288
N  2.309492 -2.067981 0.027686
N  0.06201 -3.517623 0.003225
C  3.530036 0.535515 -0.034866
C  1.909658 2.402478 0.059352
C  4.251048 1.873573 -0.318849
C  3.33283 2.932767 0.342708
C  -3.834209 -0.311637 0.012691
C  -2.726894 1.90031 -0.024016
C  -4.878452 0.799158 0.277726
C  -4.232249 2.065245 -0.345651
C  1.013971 0.087552 0.002799
C  -1.336433 -0.205609 -0.000662
C  1.153237 -1.376874 0.007053
C  -0.112455 -2.157113 -0.000698
H  3.704401 -0.233084 -0.803938
H  3.835852 0.096736 0.934151
H  1.166764 2.662656 0.83197
H  1.510662 2.761585 -0.909754
H  4.30918 2.048118 -1.409135
H  5.277604 1.879078 0.08342
H  3.514296 2.967227 1.43274
H  3.48478 3.947271 -0.061729
H  -3.811024 -1.100496 0.782902
H  -3.992034 -0.815121 -0.961211
H  -2.060599 2.360285 -0.772594
H  -2.46748 2.334994 0.962225
H  -5.015049 0.938904 1.366169
H  -5.8610 0.557621 -0.16089
H  -4.38555 2.06876 -1.440744
H  -4.643436 3.004712 0.060586
