program: Gaussian 09
title: 000018084
version: EM64L-G09RevD.01
frameworkgroup: C1[X(C9H14O4)]
method: RPBEPBE
basis: SDD
operation: Freq
keyword: #pfreq=noraman
keyword: PBEPBE/SDD
title: #p freq=noraman PBEPBE/SDD
converged: YES YES NO NO
title: Mulliken charges:
elementType: O O O O C C C C C C C C C H H H H H H H H H H H H H H
charge: -0.265216 -0.269598 -0.237388 -0.224382 -0.359339 -0.359485 -0.503033 -0.523144 0.231416 0.238949 -0.505566 0.049342 -0.572060 0.213280 0.215812 0.213506 0.215270 0.248675 0.249127 0.253837 0.253674 0.241277 0.241264 0.234030 0.257350 0.226464 0.235936
chargesum: 0.00000
title: Mulliken charges with hydrogens summed into heavy atoms:
elementType: O O O O C C C C C C C C C
charge: -0.265216 -0.269598 -0.237388 -0.224382 0.069752 0.069291 -0.005230 -0.015632 0.231416 0.238949 0.211005 0.306693 -0.109659
polarizability: 1.68370427e+02 1.38391965e+01 1.03432742e+02 5.34076560e-01 2.60019686e-01 6.83525662e+01
1716.lowfreq: -7.5625 -1.5551 -0.0005 0.0002 0.0005 5.8268 8.4424 28.7169 43.7691
frequency: -3.2645 28.6634 40.6508 45.3220 84.3035 97.3370 107.3676 118.0917 120.5882 154.2952 176.3786 180.7365 221.3478 285.2477 334.2176 392.8034 440.6687 478.3022 533.0769 549.6582 659.2461 687.6033 695.7672 724.5516 784.6401 818.3169 836.9924 900.0306 907.3061 935.5829 954.5060 969.8426 1045.8715 1054.7079 1085.0701 1091.4709 1099.5803 1112.9864 1113.5419 1133.6820 1138.3437 1148.5490 1232.3518 1244.5795 1279.7488 1286.9678 1289.7622 1309.7189 1359.6799 1374.5243 1394.0241 1422.5201 1437.7531 1442.4368 1453.2689 1464.1086 1467.2400 1482.8776 1648.1829 1655.1741 1663.5020 2986.0311 2987.9189 2992.3188 2999.7910 3004.2833 3024.1309 3033.3363 3049.0262 3069.3979 3105.8170 3121.6160 3149.0912 3159.9117 3239.2610
redmass: 6.7957 3.8160 2.2197 4.4797 2.4777 1.1164 2.4672 2.3955 3.6282 2.6429 3.0165 6.4882 4.3840 4.2702 5.5288 3.8635 3.9785 3.6439 2.6341 2.6877 4.9756 4.9393 1.5157 1.1265 1.4147 3.7175 5.2944 1.5080 1.3920 5.6233 5.0945 1.1041 3.6008 3.4424 1.8340 2.3961 3.4385 1.2665 2.7436 1.4237 2.6618 1.4392 1.2962 1.4029 1.1679 1.1400 1.0498 1.5815 1.6654 1.7293 1.1699 1.1908 1.0826 1.0849 1.0503 1.0510 1.0756 1.0953 9.0458 4.7727 10.1937 1.0613 1.0612 1.0605 1.0589 1.0299 1.0980 1.0989 1.1014 1.1033 1.1046 1.0585 1.1047 1.1000 1.1157
irintensity: 2.4148 0.1925 0.0275 1.0477 0.1287 0.1866 0.6009 0.3885 0.2796 13.2874 8.5705 2.4911 12.7114 1.0533 31.7839 3.3266 4.4965 0.4607 1.3660 2.2208 5.2140 4.8500 4.9506 15.5853 0.0183 3.8303 14.8687 3.2402 87.2878 35.7945 4.8150 45.3715 55.7007 47.8857 7.5216 2.8960 615.8120 0.5257 188.8571 27.4704 83.4457 5.0318 0.3027 148.1458 9.1089 0.8129 0.0461 0.1743 72.3643 0.0510 3.2108 23.4786 39.2985 6.5994 14.2704 11.7443 0.4287 22.4375 173.1468 66.7616 193.7490 1.2792 7.6212 0.2285 54.0724 33.2271 0.0148 0.2153 0.0865 72.0221 28.8085 0.8028 16.8215 14.3178 9.0386
temp: 298.150 k
press: 1.00000 atm
elementType: 8 8 8 8 6 6 6 6 6 6 6 6 6 1 1 1 1 1 1 1 1 1 1 1 1 1 1
symmnumber: 1
zpe: 568929.6 jmol-1
zpe.correction: 0.216694 hartree
zpe.thermalcorrener: 0.231447 hartree
zpe.thermalcorrenthalpy: 0.232391 hartree
zpe.thermalcorrgfe: 0.172552 hartree
zpe.sumelectzpe: -651.211061 hartree
zpe.sumelectthermal: -651.196308 hartree
zpe.sumelectthermalent: -651.195364 hartree
zpe.sumelectthermalfe: -651.255203 hartree
dipole: 0.9143 0.0220 -0.1218
dipole: 0.9227
quadrupole: -59.7812 -86.5087 -76.6869
quadrupole: 7.8967 -0.1872 0.2974
quadrupole: 14.5444 -12.1831 -2.3613 7.8967 -0.1872 0.2974
hfenergy: -651.4277552 hartree
pointgroup: C01 [X(C9H14O4)]
dipole: 0.3600523 0.0152983 -0.043609 debye
polarizability: 168.4087847|13.3422222|102.3484116|3.413636|5.9392548|69.3985384 unknown
InChI: InChI=1S/C9H14O4/c1-3-13-9(11)7-5-4-6-8(10)12-2/h3H,1,4-7H2,2H3
charge 0 multiplicity 1
27 atoms
O  4.814679 0.672121 0.042876
O  -3.780404 -0.472156 -0.163746
O  3.834969 -1.430154 -0.171664
O  -2.818894 1.624447 0.264584
C  1.167836 -0.295107 -0.077802
C  -0.134422 0.522814 0.0477
C  2.417877 0.594569 0.059424
C  -1.383741 -0.366588 -0.097986
C  3.7156 -0.191208 -0.038677
C  -2.679655 0.407916 0.028731
C  6.147502 0.023815 -0.034641
C  -5.09338 0.068174 -0.078816
C  -6.161149 -0.737026 -0.258522
H  1.197064 -0.818717 -1.052869
H  1.197841 -1.087395 0.694665
H  -0.161097 1.318418 -0.721861
H  -0.166672 1.041491 1.025181
H  2.416455 1.131577 1.028453
H  2.433855 1.383563 -0.717275
H  -1.391573 -1.169883 0.665267
H  -1.391246 -0.889385 -1.074435
H  6.259486 -0.505717 -0.995662
H  6.270946 -0.6967 0.79128
H  6.866303 0.850738 0.049137
H  -5.132907 1.141895 0.135493
H  -7.169377 -0.320453 -0.192364
H  -6.049796 -1.804347 -0.470371
