program: Gaussian 09
title: 000250358
version: EM64L-G09RevD.01
frameworkgroup: C1[X(C17H13NO4)]
method: RPBEPBE
basis: SDD
operation: Freq
keyword: #p
keyword: freq=noraman
keyword: PBEPBE/SDD
title: #p freq=noraman PBEPBE/SDD
converged: NO YES NO NO
title: Mulliken charges:
elementType: O O O O N C C C C C C C C C C C C C C C C C H H H H H H H H H H H H H
charge: -0.228669 -0.239427 -0.425597 -0.228028 -0.452375 0.315866 0.495965 0.003681 0.294701 -0.364011 -0.350143 -0.358599 -0.456566 -0.371339 -0.359606 -0.236310 -0.231690 -0.229205 0.190771 -0.249650 -0.273669 0.178658 0.271324 0.275711 0.310280 0.225794 0.266987 0.271403 0.323333 0.232864 0.233278 0.233748 0.285354 0.258155 0.387008
chargesum: 0.00000
title: Mulliken charges with hydrogens summed into heavy atoms:
elementType: O O O O N C C C C C C C C C C C C C C C C C
charge: -0.228669 -0.239427 -0.038589 -0.228028 -0.129042 0.315866 0.495965 0.003681 0.294701 -0.092687 -0.074432 -0.048319 -0.230772 -0.104352 -0.088203 -0.003446 0.001589 0.004543 0.190771 0.035704 -0.015513 0.178658
polarizability: 4.12197125e+02 6.66620874e+00 2.04399887e+02 1.46323592e+01 -3.74748408e+00 1.00391506e+02
1716.lowfreq: -5.7679 -0.0007 -0.0001 0.0008 1.6398 5.1577 17.2431 32.3628 39.9214
frequency: 17.2090 32.3002 39.9169 51.8918 56.7533 61.6549 95.7282 115.5576 146.0704 155.0462 159.9283 179.5053 207.7813 229.7240 265.0155 314.6948 354.8715 372.9036 387.2070 402.5989 416.1869 429.1195 476.9928 510.0133 539.1968 566.3936 585.2684 605.9726 613.8125 630.1669 646.9981 659.3370 667.3608 684.5514 704.1753 720.7523 733.1288 752.9396 801.0175 837.1886 843.9545 859.8963 876.8026 893.5981 914.5506 925.6221 946.6738 958.4994 975.6249 986.6951 989.1048 998.0677 999.3288 1004.8831 1008.7373 1026.6115 1055.7593 1084.3650 1126.6499 1152.5456 1174.6058 1186.5695 1195.3790 1216.5240 1227.2816 1261.9441 1264.8115 1285.1774 1311.2511 1319.4612 1329.0428 1366.9762 1383.2478 1419.2393 1433.3129 1476.0637 1483.4120 1505.0506 1535.8009 1577.8737 1585.6397 1592.0005 1607.7404 1618.8368 1639.8533 1651.8882 3115.8551 3128.5888 3138.3346 3144.6028 3149.3024 3150.7114 3154.4109 3159.3881 3163.2111 3169.5340 3198.6151 3520.1543 3525.5541
redmass: 7.3634 7.0623 5.9887 6.1401 5.5456 7.4592 4.6350 6.5796 4.6861 6.9891 3.2179 6.5339 5.2552 7.0594 5.9842 5.6033 6.2078 8.3179 6.2135 2.8417 3.0010 4.2993 4.5844 3.6676 3.5549 4.4463 1.8834 5.4145 6.4511 6.3580 1.5753 1.7442 3.2378 4.2384 1.6715 5.8511 5.8042 3.0603 2.4895 4.8766 1.4291 1.2983 1.5580 2.2663 5.3295 6.3553 1.4845 4.1044 1.4136 1.3856 6.0104 1.1238 1.3367 1.3449 2.7277 2.1485 2.1587 1.5838 1.3532 3.1105 1.0574 1.1204 1.1712 2.4115 1.6009 2.0114 1.3784 3.3393 1.5276 1.3509 2.1002 4.7338 8.6994 4.3733 2.2716 2.2309 2.3316 2.8979 7.1185 8.6644 5.4725 4.0612 6.0402 6.4449 8.5679 6.1833 1.0900 1.0851 1.0881 1.0979 1.0924 1.0863 1.0912 1.0958 1.0946 1.1012 1.0948 1.0763 1.0642
irintensity: 1.0248 2.3450 1.2085 0.4174 4.8686 1.5136 2.1538 0.4523 3.2657 1.7644 8.1503 1.1461 2.2109 1.2674 0.0782 5.5643 4.8470 17.7597 5.3253 0.6765 0.0597 7.1270 14.1225 12.6960 49.0759 12.3044 53.8552 28.5206 1.1422 1.5757 124.9625 19.0407 29.4704 17.2435 74.8328 34.7525 7.6163 49.3411 11.0933 7.4812 19.2695 14.7017 45.2562 5.7508 87.3622 13.0395 4.6755 11.8384 3.9241 7.2183 2.1912 59.6496 0.9570 2.2159 1.8549 6.0446 391.9247 11.4628 19.7311 10.1729 0.5944 76.2200 17.5436 98.8518 3.6430 11.0889 34.0285 460.7474 125.5403 14.1594 127.8685 84.3944 1.8427 20.3586 12.9725 3.9356 360.8693 167.7624 74.1860 176.8411 44.8151 18.6210 41.2438 67.2846 313.1743 42.8432 16.7281 0.4568 5.7349 7.4438 26.0798 3.5585 2.3702 17.8709 3.7613 24.3023 4.3470 11.2367 63.8501
temp: 298.150 k
press: 1.00000 atm
elementType: 8 8 8 8 7 6 6 6 6 6 6 6 6 6 6 6 6 6 6 6 6 6 1 1 1 1 1 1 1 1 1 1 1 1 1
symmnumber: 1
zpe: 683200.2 jmol-1
zpe.correction: 0.260217 hartree
zpe.thermalcorrener: 0.279503 hartree
zpe.thermalcorrenthalpy: 0.280448 hartree
zpe.thermalcorrgfe: 0.209507 hartree
zpe.sumelectzpe: -1009.733607 hartree
zpe.sumelectthermal: -1009.714321 hartree
zpe.sumelectthermalent: -1009.713377 hartree
zpe.sumelectthermalfe: -1009.784317 hartree
dipole: 0.9257 0.9070 1.0872
dipole: 1.6916
quadrupole: -108.3427 -135.2429 -127.7958
quadrupole: 34.7615 3.2980 -0.4731
quadrupole: 15.4511 -11.4491 -4.0020 34.7615 3.2980 -0.4731
hfenergy: -1009.9938245 hartree
pointgroup: C01 [X(C17H13N1O4)]
dipole: -0.3572978 -0.3278442 0.4558336 debye
polarizability: 411.8008465|7.5214475|204.5120116|-17.6267017|-4.1340077|100.6756601 unknown
InChI: InChI=1S/C17H13NO4/c19-15(10-11-16(20)21)18-14-8-6-13(7-9-14)17(22)12-4-2-1-3-5-12/h1-11,18,20H
charge 0 multiplicity 1
35 atoms
O  3.469403 -2.408773 0.067294
O  -2.689706 2.204236 -0.567328
O  -7.455206 -1.326428 -0.111542
O  -7.623135 0.96492 0.288776
N  -2.48044 0.020558 0.301682
C  1.7063 -0.781722 0.146067
C  -1.080459 -0.200201 0.223052
C  3.15309 -1.175243 0.07439
C  4.230351 -0.128235 0.010663
C  1.196301 0.426027 -0.401057
C  0.788961 -1.707101 0.716228
C  -0.180171 0.723539 -0.374217
C  -0.581178 -1.419566 0.765681
C  4.100117 1.147297 0.624672
C  5.456162 -0.47051 -0.622363
C  5.172939 2.065021 0.592891
C  6.519099 0.452535 -0.668309
C  6.379717 1.724722 -0.061086
C  -3.208124 1.145801 -0.096341
C  -4.692075 1.045742 0.069936
C  -5.435874 -0.089587 -0.058749
C  -6.914188 -0.042977 0.062626
H  1.876688 1.132112 -0.88736
H  1.179809 -2.651161 1.108747
H  -0.564915 1.650076 -0.802607
H  -1.273759 -2.138982 1.221577
H  3.178892 1.407686 1.15616
H  5.551724 -1.468059 -1.06383
H  -3.018035 -0.726589 0.749041
H  5.069925 3.040229 1.081213
H  7.455516 0.184485 -1.16953
H  7.208308 2.441189 -0.090753
H  -5.199784 2.006186 0.223092
H  -5.005257 -1.070661 -0.289476
H  -8.446298 -1.281868 -0.030639
