program: Gaussian 09
title: 000254421
version: EM64L-G09RevD.01
frameworkgroup: C1[X(C9H10Cl2N4)]
method: RPBEPBE
basis: SDD
operation: Freq
keyword: #p
keyword: freq=noraman
keyword: PBEPBE/SDD
title: #p freq=noraman PBEPBE/SDD
converged: YES YES NO NO
title: Mulliken charges:
elementType: Cl Cl N N N N C C C C C C C C C H H H H H H H H H H
charge: 0.042576 0.023632 -0.155800 -0.029378 0.080850 0.149823 -0.379971 -0.347938 -0.338529 0.163356 0.126031 -0.211310 -0.689881 -0.299184 -0.365690 0.217587 0.248694 0.205117 0.231478 0.194958 0.205318 0.274162 0.222882 0.218623 0.212594
chargesum: 0.00000
title: Mulliken charges with hydrogens summed into heavy atoms:
elementType: Cl Cl N N N N C C C C C C C C C
charge: 0.042576 0.023632 -0.155800 -0.029378 0.080850 0.149823 0.086311 0.088657 0.061747 0.163356 0.126031 0.062852 -0.035782 -0.299184 -0.365690
polarizability: 1.85167405e+02 -3.65073814e+00 1.70798104e+02 -1.56699268e+01 -6.10195387e-01 7.99642555e+01
1716.lowfreq: -6.2534 -0.0017 0.0007 0.0016 1.2564 5.7152 27.3497 39.2736 64.8673
frequency: 26.2964 39.2144 64.7729 102.6421 107.9873 129.8156 172.6021 179.6767 198.5758 234.9379 240.6690 277.5681 318.3371 352.1322 368.6573 397.4977 431.9402 540.0715 581.6869 604.9868 643.3381 669.6694 710.9385 738.2728 757.6318 787.5337 791.7179 811.7909 845.4949 903.4136 908.5783 929.2983 1015.9277 1067.9243 1070.9194 1099.6645 1114.9878 1170.9478 1197.2442 1202.2347 1248.9546 1272.6522 1282.9487 1291.8997 1305.4348 1312.6554 1342.2164 1350.4174 1366.4138 1379.7141 1395.9375 1442.9940 1468.7992 1471.4466 1479.0864 1479.9433 1489.0355 1502.8620 1567.3730 2969.1576 2979.2412 2987.0777 3013.2342 3016.2431 3047.7149 3075.4269 3080.7446 3084.4048 3230.4418
redmass: 4.4751 6.1603 1.5585 5.7920 2.7077 7.9888 8.1520 3.8955 5.8355 1.2916 3.7513 4.9406 5.1745 5.3495 16.1239 14.7793 3.6710 5.5251 9.5546 10.7108 4.9340 12.2813 6.1436 1.0938 9.4654 5.3522 1.3107 11.3842 1.5138 1.9406 3.7114 1.3900 4.0176 2.5637 2.4914 4.4362 2.3597 3.8989 1.8711 3.1073 1.7793 1.2923 2.0212 1.1135 4.4259 6.3778 1.6570 1.7774 1.4871 7.6119 1.2121 2.2634 1.3075 1.1774 1.1116 1.0518 1.1036 6.5138 9.3474 1.0593 1.0369 1.0603 1.0827 1.0758 1.1026 1.1015 1.0997 1.1055 1.0987
irintensity: 0.2214 0.0807 0.0232 0.1877 0.1040 0.8650 1.1075 1.4420 0.2626 0.2631 0.8897 1.9785 0.8148 0.8895 2.2675 2.9094 1.2299 6.3104 1.7262 30.8301 16.3423 1.0440 12.6125 8.0573 43.9469 2.9407 0.7603 72.3013 15.1628 3.0728 76.7666 12.3172 2.8474 3.6700 1.0719 106.7374 16.2059 68.8371 80.5278 36.0875 39.0811 1.8325 16.7550 4.2847 109.7672 110.1284 29.2801 24.2031 10.6544 64.8346 10.5383 73.7783 48.1432 33.5899 18.7912 9.8831 36.7009 119.0644 140.7280 27.9294 27.1817 26.3355 20.6485 24.2397 9.2615 34.1781 43.8073 47.8750 0.1729
temp: 298.150 k
press: 1.00000 atm
elementType: 17 17 7 7 7 7 6 6 6 6 6 6 6 6 6 1 1 1 1 1 1 1 1 1 1
symmnumber: 1
zpe: 482944.8 jmol-1
zpe.correction: 0.183944 hartree
zpe.thermalcorrener: 0.198250 hartree
zpe.thermalcorrenthalpy: 0.199194 hartree
zpe.thermalcorrgfe: 0.140372 hartree
zpe.sumelectzpe: -1486.975571 hartree
zpe.sumelectthermal: -1486.961265 hartree
zpe.sumelectthermalent: -1486.960321 hartree
zpe.sumelectthermalfe: -1487.019142 hartree
dipole: 6.6114 -1.7530 -1.1032
dipole: 6.9283
quadrupole: -100.0130 -109.4989 -100.5092
quadrupole: -5.0471 -0.7864 2.4794
quadrupole: 3.3274 -6.1585 2.8312 -5.0471 -0.7864 2.4794
hfenergy: -1487.1595145 hartree
pointgroup: C01 [X(C9H10Cl2N4)]
dipole: -2.59675 0.6592509 -0.5021957 debye
dipolederiv: -0.7056617 -0.3695957 -0.1896133 -0.3997331 -0.3063329 -0.1183414 -0.2079442 -0.1182382 -0.1041924 -0.1089353 0.0781941 -0.0078264 0.1734865 -0.9165668 -0.0154279 -0.0068795 -0.0214091 -0.0554523 -0.8013678 0.0679668 -0.0626898 -0.2143423 -0.5058121 -0.0230194 -0.1373657 0.0386648 -0.1895119 -0.6432646 0.029944 -0.0512709 0.0943694 -0.367106 0.0173195 -0.1194227 0.007182 -0.2428298 -0.701199 0.3096834 -0.1121489 0.1154156 -0.7767561 -0.0382689 -0.1330393 0.0467759 -0.1575296 -0.5610551 -0.3466025 -0.1318363 -0.2660021 -1.3524966 -0.1436596 -0.1469642 -0.1605573 -0.1478809 0.6856147 0.0112277 0.0617907 0.1351021 0.1737261 -0.0001175 0.1457748 -0.038269 0.2642997 -0.0904146 -0.0414665 -0.0255223 -0.076675 0.1183953 0.0187307 -0.0751676 0.0485834 0.0012889 0.110479 -0.0373282 0.0326336 -0.0348462 0.1648064 0.0061285 0.1459932 0.0109586 0.0783731 0.8204137 -0.3916341 0.1135818 -0.0687386 0.3040865 0.0409137 0.1778087 -0.0966417 0.1497085 -0.7128442 -0.1148397 -0.1963926 -0.4619136 0.098155 -0.094413 -0.254427 -0.0393373 0.0277465 0.4394406 0.1936435 0.1158142 0.4831016 0.4119577 0.083951 0.1709469 0.0695309 -0.0041597 -0.0442245 -0.0315254 0.0444364 -0.0458007 0.0738334 0.0256887 -0.0086613 0.0205079 0.0234692 1.4541489 0.4377651 0.3905877 0.5569705 1.1101136 0.2061283 0.4272797 0.1765165 0.1656652 0.756123 -0.0204407 0.1856499 -0.18973 1.982863 0.0869101 0.2036282 0.0956067 0.0603949 -0.0261666 0.0304507 -0.0531654 0.056581 -0.0379524 0.117025 -0.0339356 0.0598111 0.0240152 0.0223727 0.0138948 0.0266516 -0.042551 0.0016686 -0.1074909 0.0079517 -0.048973 0.0208534 0.0558447 -0.0150558 0.0196382 -0.0133092 -0.0753507 -0.1170041 0.0076169 -0.0863328 -0.0265743 0.0239644 0.054922 -0.0485066 0.0738779 -0.014632 0.0848478 -0.0589155 0.0563701 0.0047075 -0.0099263 0.0396293 -0.0463739 0.0801487 -0.0698674 0.1365146 -0.0678383 0.1035875 -0.0284535 0.0381374 0.0285361 0.0482213 -0.0028329 -0.0609855 -0.1311951 0.0118573 -0.1133975 -0.0538955 0.0447178 0.0619115 -0.0360461 0.0423446 0.0903179 0.0040083 -0.0385689 0.0112127 0.1557873 -0.1901996 -0.0910415 -0.026446 -0.1027573 0.0718162 -0.0074295 -0.0427157 -0.018003 0.0606797 0.0456553 0.1068658 -0.0663316 0.0697728 -0.0402296 0.1076283 -0.0175791 0.0898133 0.0022966 0.0983472 -0.0051048 0.0151645 0.0380616 -0.0776515 -0.1394271 0.0505673 -0.0939627 -0.0288059 unknown
polarizability: 184.2828872|-3.6537979|170.6803089|18.6084721|1.5731616|80.9665692 unknown
InChI: InChI=1S/C9H10Cl2N4/c1-2-3-4-15-5-12-6-7(10)13-9(11)14-8(6)15/h5H,2-4H2,1H3
charge 0 multiplicity 1
25 atoms
Cl 4.071378 1.309263 0.816566
Cl 1.845038 -3.504023 -0.061593
N  -0.769108 0.911945 -0.588518
N  0.9625 2.328628 -0.020088
N  0.395622 -1.256439 -0.357115
N  2.722125 -0.986364 0.317509
C  -2.12686 0.447758 -0.943947
C  -2.973063 0.074936 0.294071
C  -4.385706 -0.407646 -0.106421
C  0.323827 0.098745 -0.309112
C  1.397058 0.996038 0.039424
C  -0.326801 2.23151 -0.393017
C  -5.240937 -0.794302 1.119372
C  2.614321 0.353388 0.353773
C  1.625634 -1.711058 -0.031587
H  -2.616803 1.25062 -1.524645
H  -2.014638 -0.431787 -1.602728
H  -3.053171 0.951895 0.966474
H  -2.453746 -0.722803 0.858569
H  -4.901353 0.388201 -0.682004
H  -4.296237 -1.279837 -0.784876
H  -0.988479 3.082567 -0.54456
H  -6.245259 -1.139004 0.814262
H  -4.763508 -1.609867 1.693322
H  -5.371538 0.066337 1.801571
