program: Gaussian 09
title: 000250356
version: EM64L-G09RevD.01
frameworkgroup: C1[X(C16H12ClNO3)]
method: RPBEPBE
basis: SDD
operation: Freq
keyword: #p
keyword: freq=noraman
keyword: PBEPBE/SDD
title: #p freq=noraman PBEPBE/SDD
converged: YES YES NO NO
title: Mulliken charges:
elementType: Cl O O O N C C C C C C C C C C C C C C C C H H H H H H H H H H H H
charge: -0.023496 -0.259927 -0.402361 -0.222358 -0.433933 0.374181 0.335505 0.486863 -0.375739 -0.393207 -0.473302 -0.359340 -0.392864 -0.391483 -0.234894 -0.235574 -0.240910 0.209414 -0.176373 -0.190086 0.237203 0.240986 0.241003 0.226379 0.309989 0.235638 0.239174 0.306173 0.226175 0.227008 0.230816 0.282964 0.396376
chargesum: 0.00000
title: Mulliken charges with hydrogens summed into heavy atoms:
elementType: Cl O O O N C C C C C C C C C C C C C C C C
charge: -0.023496 -0.259927 -0.005986 -0.222358 -0.127760 0.374181 0.335505 0.486863 -0.134753 -0.152203 -0.246923 -0.049351 -0.157227 -0.152309 -0.008720 -0.008565 -0.010093 0.209414 0.106590 -0.190086 0.237203
polarizability: 4.92801250e+02 1.23111580e+01 2.01036560e+02 -2.03989501e+00 5.50538852e+00 8.47270688e+01
1716.lowfreq: -3.9611 -0.0008 0.0003 0.0022 2.5117 4.7999 14.8763 22.4872 48.1043
frequency: 14.7053 22.4154 48.0948 49.3755 55.4987 74.5654 96.4917 105.3091 153.1425 158.9951 181.9255 228.6716 243.9269 290.7409 329.0842 359.7214 373.9226 394.4834 404.9263 412.6508 414.8295 433.4505 501.6808 526.1520 556.5344 591.9904 607.1482 613.7527 634.4799 647.4822 669.7377 684.6276 700.5733 701.6716 718.9560 732.4483 742.0121 772.5762 831.9555 846.3918 852.4638 865.7053 919.8860 930.9737 933.3127 952.4419 967.0193 973.7112 987.4707 992.5475 993.7751 994.4075 1017.3525 1041.1760 1075.2407 1085.8784 1130.3044 1174.0078 1191.4881 1201.9364 1216.3212 1262.2967 1273.9858 1293.2686 1305.9945 1318.8862 1329.6389 1359.0945 1376.4454 1422.9320 1436.9746 1476.6076 1509.5064 1517.2034 1562.2091 1581.8452 1594.2321 1604.0325 1612.1603 1621.7900 1625.8751 3115.0082 3123.3708 3127.5580 3129.4544 3140.2398 3143.3544 3149.3835 3151.8516 3165.6780 3198.5501 3451.3366 3528.9720
redmass: 7.2110 6.8080 6.1171 7.6991 9.5781 4.4259 5.5220 6.1411 6.2751 8.3127 7.0461 5.2563 13.7183 6.5524 5.3643 6.7589 9.0658 4.7699 2.8668 3.0126 14.7963 4.4225 3.3306 7.0626 2.4711 4.8307 1.2345 6.4925 6.9339 7.0171 2.7223 5.7342 1.4644 1.6844 7.7808 3.0352 5.9202 1.9834 1.4052 2.1305 1.9995 1.4648 1.4649 1.4303 9.4509 1.3884 5.0763 1.4595 3.9216 4.7232 1.5383 1.3200 2.7656 1.8878 2.1061 1.6230 1.3748 1.0530 1.1128 1.1674 4.0296 1.6143 1.6397 3.1897 1.4574 1.4271 2.5931 3.0048 8.7072 4.2247 2.3624 2.1883 2.3973 3.0090 7.5905 4.1206 3.5587 7.0567 6.0320 8.6575 6.2012 1.0889 1.0845 1.0874 1.0875 1.0917 1.0911 1.0959 1.0948 1.1016 1.0945 1.0774 1.0644
irintensity: 0.5018 0.1034 2.3737 0.2895 0.1863 0.7805 5.3067 1.2825 0.9532 0.2937 1.3889 0.1446 1.9775 1.9431 5.9917 8.5867 6.9079 18.4055 1.6113 0.6121 0.5117 0.6866 17.6622 23.4736 8.2538 78.1145 111.4684 0.8297 4.5845 15.1893 41.0882 13.7896 40.6138 22.5541 60.4200 8.0550 0.5545 81.9033 31.9933 7.4589 2.6444 47.1606 2.3813 20.6240 9.4228 1.6554 6.1261 0.3707 0.9777 10.7724 2.8461 0.0476 0.6602 5.3396 630.3846 8.7560 16.6372 0.0390 1.2222 2.2402 6.9938 41.9719 47.9431 0.2965 2.2962 6.0595 164.1635 26.1730 1.9560 14.5262 9.0390 61.2881 109.6475 42.4546 113.8783 24.5159 43.4743 398.6053 28.4223 101.7668 0.4738 15.7940 7.8898 0.8897 7.7861 19.2050 4.1643 33.5828 16.7093 38.0019 4.7214 80.1956 93.1647
temp: 298.150 k
press: 1.00000 atm
elementType: 17 8 8 8 7 6 6 6 6 6 6 6 6 6 6 6 6 6 6 6 6 1 1 1 1 1 1 1 1 1 1 1 1
symmnumber: 1
zpe: 633627.5 jmol-1
zpe.correction: 0.241336 hartree
zpe.thermalcorrener: 0.259838 hartree
zpe.thermalcorrenthalpy: 0.260782 hartree
zpe.thermalcorrgfe: 0.191177 hartree
zpe.sumelectzpe: -1355.927231 hartree
zpe.sumelectthermal: -1355.908729 hartree
zpe.sumelectthermalent: -1355.907785 hartree
zpe.sumelectthermalfe: -1355.977390 hartree
dipole: -0.2583 -3.6334 0.3896
dipole: 3.6633
quadrupole: -100.8489 -130.4253 -132.4592
quadrupole: -12.1894 0.8898 3.6238
quadrupole: 20.3955 -9.1809 -11.2147 -12.1894 0.8898 3.6238
hfenergy: -1356.168567 hartree
pointgroup: C01 [X(C16H12Cl1N1O3)]
dipole: -0.1738987 -0.8247872 -1.169082 debye
polarizability: 492.7429676|-14.1163031|108.235187|6.2696794|46.3401898|177.586724 unknown
InChI: InChI=1S/C16H12ClNO3/c17-14(16(20)21)10-15(19)18-13-8-6-12(7-9-13)11-4-2-1-3-5-11/h1-10,18,20H
charge 0 multiplicity 1
33 atoms
Cl 4.037487 -1.456648 -1.613733
O  2.249565 1.124743 1.935549
O  6.863428 -1.251494 -1.167681
O  6.914179 0.063379 0.749186
N  1.676109 -0.187331 0.067012
C  -2.604651 -0.034743 -0.01211
C  -4.092587 0.003121 -0.06362
C  0.258459 -0.102346 0.090568
C  -1.851874 -0.771157 -0.970244
C  -1.879405 0.662198 0.992955
C  -0.44932 -0.806641 -0.923237
C  -0.473682 0.639087 1.058311
C  -4.784578 -0.063811 -1.305608
C  -4.864863 0.108742 1.127254
C  -6.193996 -0.027144 -1.355509
C  -6.274293 0.147023 1.078619
C  -6.947663 0.07887 -0.163363
C  2.583106 0.398083 0.942531
C  4.041324 0.16221 0.704623
C  4.769549 -0.519128 -0.226674
C  6.263607 -0.525543 -0.146025
H  -2.372335 -1.348759 -1.741527
H  -2.42408 1.265802 1.727119
H  0.103846 -1.391843 -1.668884
H  0.064798 1.187812 1.832226
H  -4.215316 -0.110947 -2.241008
H  -4.359629 0.129244 2.099504
H  2.073267 -0.74977 -0.694266
H  -6.704258 -0.070607 -2.324313
H  -6.847461 0.220057 2.009672
H  -8.042133 0.108183 -0.201602
H  4.650431 0.668027 1.466897
H  7.851865 -1.215471 -1.05742
