program: Gaussian 09
title: 000254461
version: EM64L-G09RevD.01
frameworkgroup: C1[X(C18H22N2O3)]
method: RPBEPBE
basis: SDD
operation: Freq
keyword: #p
keyword: freq=noraman
keyword: PBEPBE/SDD
title: #p freq=noraman PBEPBE/SDD
converged: YES YES NO NO
title: Mulliken charges:
elementType: O O O N N C C C C C C C C C C C C C C C C C C H H H H H H H H H H H H H H H H H H H H H H
charge: -0.265282 -0.193461 -0.215718 -0.320317 -0.373296 0.283713 -0.549085 -0.489181 -0.455090 -0.435752 0.189027 0.073270 0.130708 0.163161 0.203982 -0.032941 -0.347967 -0.352005 -0.359595 -0.698046 -0.210841 -0.214075 -0.698902 0.236887 0.264120 0.275126 0.232498 0.225766 0.213267 0.223662 0.219835 0.309810 0.246265 0.196281 0.180612 0.219270 0.196835 0.231175 0.269141 0.267816 0.262988 0.207483 0.214798 0.237046 0.237011
chargesum: 0.00000
title: Mulliken charges with hydrogens summed into heavy atoms:
elementType: O O O N N C C C C C C C C C C C C C C C C C C
charge: -0.265282 -0.193461 -0.215718 -0.320317 -0.063485 0.283713 -0.048078 0.018443 -0.016058 0.007745 0.189027 0.073270 0.130708 0.163161 0.203982 0.213324 0.028926 -0.082865 -0.091779 -0.050766 0.026205 0.022936 -0.013633
polarizability: 2.75389160e+02 -1.50603712e+01 2.09898114e+02 -2.00930008e+01 -2.27333333e+01 1.58276640e+02
1716.lowfreq: -13.6817 -6.8620 -5.5681 -0.0004 0.0003 0.0003 17.3204 23.3250 30.9343
frequency: 15.6317 22.3693 30.7801 41.8070 68.4859 99.0904 115.8935 125.3442 130.7681 141.5017 151.2067 161.2419 180.9843 203.3599 217.2568 233.7697 246.8470 254.3721 266.3325 290.0445 313.4430 346.5006 369.8527 379.2024 399.2632 422.5992 453.6646 457.3168 472.5864 525.4206 556.5871 557.4799 571.1866 619.5236 657.1022 658.0455 689.7380 699.8509 715.4477 739.7023 779.2949 785.2889 787.0506 795.3813 802.8679 820.6876 849.6895 857.1741 880.4381 900.5572 906.2461 916.2603 954.9068 969.5294 974.3166 987.0935 1005.1181 1005.7909 1007.4055 1027.3344 1036.6584 1044.7162 1054.3846 1075.2383 1076.9885 1117.0180 1133.9064 1145.5969 1165.1219 1166.3692 1172.7602 1179.9181 1192.7610 1201.4954 1212.3857 1225.4397 1249.5999 1262.6545 1277.8530 1282.2596 1296.3630 1297.9901 1312.0805 1316.6659 1321.9313 1339.6546 1341.4037 1385.5510 1401.5470 1416.5941 1453.8189 1455.0816 1457.5516 1458.9365 1466.2619 1473.4536 1478.2825 1478.8320 1485.0014 1493.7863 1496.4031 1505.1249 1604.6098 1617.0452 1619.6013 1624.6183 1675.0050 2957.6357 2973.8980 2983.1281 2994.2789 3012.1767 3016.0838 3018.9729 3033.1629 3037.5617 3048.2372 3071.0029 3074.7987 3075.3178 3084.4250 3088.0433 3089.8208 3111.7548 3138.1313 3152.4702 3164.7089 3174.0203 3543.4096
redmass: 4.8799 3.6249 5.5083 6.3584 3.7776 3.0974 2.4304 2.9956 4.1764 4.7428 2.5195 3.3616 6.2508 1.9624 1.3256 1.7363 1.5888 5.3463 3.9010 4.0653 2.9170 10.2124 4.6361 3.3438 2.7858 3.4615 4.8183 2.8299 2.3114 7.3066 6.6945 1.7619 2.1543 4.6539 4.9515 5.0978 7.4556 5.7172 3.0325 3.3731 1.4126 1.3277 4.6106 1.7894 2.9427 2.0055 2.4264 5.0686 2.6616 2.3902 1.3986 2.1473 2.1847 1.2592 1.4121 1.5747 2.6826 1.3615 1.5084 2.4315 2.0770 3.4431 3.2474 2.6664 2.2357 2.4355 4.6028 2.1374 1.2761 2.1133 2.0579 1.3596 1.8560 1.7626 2.2083 1.5232 1.3383 1.3629 1.3031 1.5158 1.2811 1.3400 5.6666 1.4059 1.5070 1.4320 1.4542 1.2184 1.2041 6.6876 2.4573 1.2071 2.5520 1.1053 1.1449 1.0494 1.0792 1.0488 1.2620 1.1774 1.0594 1.1152 8.5975 8.8220 7.9162 10.0446 12.6447 1.0623 1.0374 1.0368 1.0621 1.0627 1.0944 1.0661 1.0655 1.0886 1.0978 1.0975 1.1011 1.0993 1.1022 1.1001 1.0996 1.1032 1.0864 1.0906 1.0956 1.1003 1.0766
irintensity: 4.5347 2.0455 1.3096 4.1377 1.2674 0.0433 1.2358 1.1966 1.2545 1.4318 0.5962 0.8608 1.6771 0.9771 0.2613 1.2493 1.4598 1.0056 2.4662 7.0885 5.6062 16.7841 6.2472 2.6788 5.5089 3.8821 0.0459 1.2034 8.0755 8.0471 1.9380 72.6497 7.8593 13.9278 6.9851 11.3363 0.7507 9.3067 64.9010 19.7095 11.3885 10.0291 3.2818 21.2923 4.6260 1.5484 0.5409 15.2530 10.4802 3.4008 0.0451 6.2460 5.6923 10.2601 1.9851 4.1431 3.1448 0.0716 12.1410 3.3645 22.3255 1.8266 62.5571 2.8599 6.2294 6.2705 17.2722 16.8629 10.9190 9.5657 3.1102 5.2538 50.7481 2.1191 8.0149 5.6275 5.2360 39.4757 1.3010 4.3018 6.2202 4.9295 341.7467 33.8915 53.1687 7.6351 3.0083 18.4854 12.0065 12.0887 11.6688 26.9588 3.0725 27.6358 70.9428 8.6036 6.5065 15.5497 85.9087 30.9514 9.2023 19.3308 121.5908 219.3773 4.1299 264.7900 56.9729 41.0085 36.1559 22.8115 32.3744 57.7366 24.1146 10.9999 7.5206 7.7516 9.2864 32.2330 20.8541 52.5272 55.4403 18.7952 39.5329 16.6699 1.9927 6.8407 6.3940 23.7607 14.6264
temp: 298.150 k
press: 1.00000 atm
elementType: 8 8 8 7 7 6 6 6 6 6 6 6 6 6 6 6 6 6 6 6 6 6 6 1 1 1 1 1 1 1 1 1 1 1 1 1 1 1 1 1 1 1 1 1 1
symmnumber: 1
zpe: 968995.5 jmol-1
zpe.correction: 0.369071 hartree
zpe.thermalcorrener: 0.391127 hartree
zpe.thermalcorrenthalpy: 0.392071 hartree
zpe.thermalcorrgfe: 0.316333 hartree
zpe.sumelectzpe: -1032.637140 hartree
zpe.sumelectthermal: -1032.615084 hartree
zpe.sumelectthermalent: -1032.614140 hartree
zpe.sumelectthermalfe: -1032.689878 hartree
dipole: -0.3063 -0.3589 2.8246
dipole: 2.8638
quadrupole: -103.6530 -135.1622 -143.1428
quadrupole: -7.9327 -1.7418 4.7239
quadrupole: 23.6663 -7.8428 -15.8235 -7.9327 -1.7418 4.7239
hfenergy: -1033.0062107 hartree
pointgroup: C01 [X(C18H22N2O3)]
dipole: -0.1585184 -0.7370937 -0.837266 debye
polarizability: 271.087487|30.7452361|163.2907646|-2.8213299|-26.6945554|209.1856618 unknown
InChI: InChI=1S/C18H22N2O3/c1-3-12(2)19-17(23)18(10-6-7-11-18)20-15(21)13-8-4-5-9-14(13)16(20)22/h4-5,8-9,12,19H,3,6-7,10-11H2,1-2H3
charge 0 multiplicity 1
45 atoms
O  -1.15792 1.337919 1.079736
O  1.964745 -0.561183 2.36919
O  0.013112 -0.252439 -1.925261
N  0.673366 -0.62486 0.33554
N  -2.863798 0.029125 0.187023
C  -0.676329 -1.059723 0.782133
C  -1.163376 -2.31346 -0.016759
C  -0.725739 -1.575115 2.256637
C  -2.169714 -3.063082 0.916605
C  -2.049593 -2.373459 2.314208
C  -1.590494 0.215864 0.675027
C  1.827711 -0.346134 1.141938
C  0.878373 -0.195975 -1.013523
C  2.8442 0.234039 0.204437
C  2.277737 0.319172 -1.086426
C  -3.852601 1.125194 0.055995
C  -4.156421 1.420406 -1.437879
C  4.155659 0.660993 0.458955
C  2.999795 0.834519 -2.17358
C  -5.133591 0.781706 0.848512
C  4.89722 1.184043 -0.632266
C  4.328096 1.26914 -1.929074
C  -2.921307 1.872134 -2.244342
H  -0.27633 -2.947282 -0.196633
H  -1.563598 -2.054589 -1.010852
H  -0.661039 -0.757319 2.990318
H  0.134344 -2.244037 2.432181
H  -1.902489 -4.132604 0.978984
H  -3.208084 -3.023914 0.536501
H  -2.902645 -1.691838 2.484968
H  -2.042753 -3.103486 3.141885
H  -3.124676 -0.885873 -0.184891
H  -3.362994 2.008907 0.504576
H  -4.939072 2.204386 -1.472477
H  -4.604037 0.514818 -1.900861
H  -5.853957 1.617965 0.795699
H  -5.631324 -0.117125 0.434895
H  -4.900464 0.592439 1.911028
H  4.58045 0.594529 1.46539
H  2.547228 0.900084 -3.167879
H  -2.128479 1.103804 -2.233743
H  -3.190253 2.072246 -3.297788
H  -2.491393 2.798015 -1.8196
H  5.923872 1.531065 -0.47302
H  4.924159 1.680185 -2.750909
