program: Gaussian 09
title: 000254451
version: EM64L-G09RevD.01
frameworkgroup: C1[X(C17H24O4)]
method: RPBEPBE
basis: SDD
operation: Freq
keyword: #pfreq=noraman
keyword: PBEPBE/SDD
title: #p freq=noraman PBEPBE/SDD
converged: YES YES NO NO
title: Mulliken charges:
elementType: O O O O C C C C C C C C C C C C C C C C C H H H H H H H H H H H H H H H H H H H H H H H H
charge: -0.274694 -0.275093 -0.243441 -0.259657 -0.261162 -0.217159 -0.206267 0.487613 -0.739050 -0.732413 0.233309 0.250730 -0.466096 -0.399183 -0.230909 -0.253274 -0.243980 -0.262109 -0.268225 -0.669459 -0.658999 0.233322 0.290334 0.261088 0.224415 0.248242 0.224023 0.246803 0.224486 0.232450 0.229791 0.297554 0.222986 0.224431 0.225939 0.221043 0.234515 0.237665 0.219140 0.256805 0.221258 0.216777 0.215804 0.272515 0.208131
chargesum: 0.00000
title: Mulliken charges with hydrogens summed into heavy atoms:
elementType: O O O O C C C C C C C C C C C C C C C C C
charge: -0.274694 -0.275093 -0.243441 -0.259657 -0.027840 0.073175 0.054821 0.487613 -0.042369 -0.028674 0.233309 0.250730 -0.236306 -0.101629 -0.007923 -0.028843 -0.018041 0.193450 0.188580 0.025381 0.037451
polarizability: 2.47942318e+02 -1.34902532e+00 1.73055435e+02 -1.67782296e+00 -1.91946240e+01 1.57148036e+02
1716.lowfreq: -6.4817 -0.0005 0.0006 0.0008 5.5628 9.2706 24.3873 34.1487 39.5682
frequency: 24.3693 33.9706 39.4613 47.7652 52.1285 56.9226 80.0347 82.1725 85.6832 90.6752 123.9294 134.8089 174.0674 184.6459 208.1136 217.2068 223.0593 226.8599 232.2808 244.1081 251.9855 265.7193 297.5416 325.4819 340.6683 377.9241 406.6476 422.5556 436.5180 482.4356 517.2178 543.6710 592.7652 618.3527 642.9649 679.8746 707.8065 710.3005 718.3587 742.6874 754.6302 774.8301 810.4973 816.6358 828.2703 850.0958 861.7371 865.1001 910.3434 928.3946 953.5111 983.2806 990.2635 994.4452 1003.8383 1006.4211 1012.4752 1023.7159 1030.6737 1054.8253 1074.5068 1080.1353 1094.9907 1097.0948 1099.0815 1123.6310 1136.5686 1153.7942 1158.4325 1171.3221 1193.8944 1196.9361 1220.3444 1248.7540 1268.7949 1276.1510 1276.9756 1299.0067 1312.2687 1325.4617 1338.8755 1350.7257 1353.8838 1365.0036 1382.8554 1384.9115 1389.0390 1391.9047 1399.4296 1442.8868 1455.1920 1460.0536 1464.3433 1465.6847 1471.4403 1473.3730 1476.9165 1479.3451 1482.3146 1483.2645 1485.6468 1589.1486 1611.6179 1623.4308 1632.1937 2988.6439 2988.8618 2989.6654 2989.9252 2991.1787 3019.7700 3028.2048 3028.9588 3051.3159 3083.5967 3084.1127 3086.1985 3086.7838 3090.1013 3093.9459 3098.3367 3101.0510 3109.5759 3115.9580 3116.8587 3123.2083 3136.3210 3149.9541 3161.0794
redmass: 4.7908 4.1826 2.7058 3.3939 4.3958 4.2647 4.1692 4.1844 3.9303 3.5392 4.9446 3.2313 2.5885 2.9527 2.2297 1.5138 1.1335 1.2056 1.4725 3.2280 3.1769 2.4909 2.6417 3.5373 3.8638 3.7609 2.8637 3.3867 3.6437 3.7887 3.8506 4.9058 3.6538 6.3371 3.2876 4.3791 4.3019 1.8896 5.4578 2.7549 2.7984 2.0039 1.4903 1.4946 2.5431 2.9942 1.2644 2.4305 1.9800 1.4842 2.2503 1.5114 3.6972 1.8407 1.4892 2.1328 2.0747 2.9150 2.2141 1.9794 2.3196 2.6280 2.3174 2.6859 2.2255 2.5413 2.1908 1.6687 1.6786 1.0572 1.9317 1.6303 2.0655 1.4668 1.3774 1.1340 1.1221 1.2985 1.3017 1.2959 1.2861 1.2984 1.2799 1.6533 2.0931 1.3421 1.4190 1.2302 1.2245 2.1008 1.0951 1.0863 1.0460 1.0437 1.0466 1.0494 1.0644 1.0785 1.0549 2.0679 1.0587 5.9003 5.9719 8.9907 8.3811 1.0527 1.0603 1.0359 1.0383 1.0364 1.0830 1.0585 1.0593 1.0854 1.0994 1.0979 1.0996 1.0996 1.1025 1.1030 1.1001 1.1008 1.0872 1.1065 1.1052 1.0865 1.0924 1.0952 1.1012
irintensity: 0.0980 0.2460 0.1018 0.0929 1.0123 1.1907 0.4893 1.3323 0.7636 0.8690 0.3773 3.5993 1.9939 2.7356 3.6975 1.9810 0.6586 1.4302 0.7129 0.0968 0.5857 4.5715 2.5188 11.4657 14.3144 0.9873 0.6431 9.1854 1.7588 8.9577 8.0559 3.2634 10.2075 0.8660 2.6439 1.4713 4.3879 58.7634 12.0149 14.5955 9.9658 27.0016 5.8502 1.5549 4.2511 6.7102 0.8501 2.5415 5.7345 5.7058 4.3452 1.6733 0.1445 20.5263 3.4330 11.4795 42.7519 185.4248 1.3308 62.6270 63.5236 108.5619 62.8673 145.1418 5.3037 15.4041 55.6696 16.5131 17.8077 0.0869 57.0433 47.7426 24.6195 21.5603 2.9644 3.7241 4.0134 28.6166 2.3370 0.1704 5.6649 2.7242 1.6259 5.0426 1.0669 14.1447 12.7478 19.8596 17.9748 12.0582 13.3933 13.7505 8.0798 14.5053 16.8186 7.8590 18.9290 6.1332 30.4676 25.3788 21.2040 1.9698 6.9507 182.1193 132.6630 13.1158 23.0445 15.0828 26.4467 18.3540 11.7358 46.5105 28.2636 1.1817 29.8557 42.5859 21.7610 27.8291 5.2836 9.7642 16.5146 24.7682 10.1396 26.8668 27.6034 2.9476 31.9489 5.7808 43.1190
temp: 298.150 k
press: 1.00000 atm
elementType: 8 8 8 8 6 6 6 6 6 6 6 6 6 6 6 6 6 6 6 6 6 1 1 1 1 1 1 1 1 1 1 1 1 1 1 1 1 1 1 1 1 1 1 1 1
symmnumber: 1
zpe: 987355.5 jmol-1
zpe.correction: 0.376064 hartree
zpe.thermalcorrener: 0.399280 hartree
zpe.thermalcorrenthalpy: 0.400224 hartree
zpe.thermalcorrgfe: 0.321705 hartree
zpe.sumelectzpe: -961.505938 hartree
zpe.sumelectthermal: -961.482722 hartree
zpe.sumelectthermalent: -961.481777 hartree
zpe.sumelectthermalfe: -961.560297 hartree
dipole: -1.0819 -1.1111 2.2908
dipole: 2.7663
quadrupole: -114.1318 -117.9225 -127.9090
quadrupole: -0.6339 -3.7698 -3.1089
quadrupole: 5.8560 2.0653 -7.9213 -0.6339 -3.7698 -3.1089
hfenergy: -961.8820015 hartree
pointgroup: C01[X(C17H24O4)]
dipole: -0.5753512 0.5114534 -0.7693503 debye
polarizability: 236.7154487|23.1083693|192.3581783|15.2952126|-5.956362|149.0721619 unknown
InChI: InChI=1S/C17H24O4/c1-5-20-16(18)12(3)15(13(4)17(19)21-6-2)14-10-8-7-9-11-14/h7-13,15H,5-6H2,1-4H3
charge 0 multiplicity 1
45 atoms
O  -2.454245 1.582844 0.470931
O  -1.198577 -2.173295 -1.387208
O  -2.545845 -0.491912 1.529435
O  0.499944 -2.141379 0.206329
C  0.37266 0.935142 -0.005357
C  -0.378939 0.700693 1.353734
C  -0.053875 -0.090687 -1.119613
C  1.883072 1.074864 0.215058
C  -0.150002 1.874133 2.342109
C  0.871274 -0.032133 -2.366588
C  -1.878016 0.497318 1.144098
C  -0.183281 -1.544752 -0.659913
C  2.521553 2.297568 -0.118566
C  2.675002 0.028959 0.76135
C  3.909315 2.478808 0.081191
C  4.061681 0.207968 0.962768
C  4.686697 1.431302 0.624761
C  -3.922312 1.495156 0.192685
C  -1.503106 -3.598892 -1.038876
C  -4.179697 0.750981 -1.121043
C  -2.679676 -3.649165 -0.060695
H  0.014443 1.911065 -0.390381
H  -0.012077 -0.236777 1.806949
H  -1.068304 0.20227 -1.448729
H  -0.682095 1.696504 3.293863
H  0.925815 1.976744 2.563292
H  -0.514262 2.823985 1.912364
H  1.888559 -0.383699 -2.12536
H  0.949778 1.009485 -2.7271
H  0.460947 -0.653771 -3.181246
H  1.923902 3.118611 -0.535175
H  2.204054 -0.928701 1.004992
H  4.379571 3.432681 -0.184218
H  4.65648 -0.611473 1.382899
H  5.762801 1.565887 0.78306
H  -4.241068 2.548748 0.143223
H  -4.409542 0.986845 1.043095
H  -0.594854 -4.053708 -0.606795
H  -1.742208 -4.067158 -2.007745
H  -3.830226 -0.293458 -1.056104
H  -3.66771 1.246542 -1.964514
H  -5.264531 0.741044 -1.336214
H  -3.58332 -3.196338 -0.504687
H  -2.442982 -3.103325 0.867607
H  -2.907093 -4.701522 0.193136
