program: Gaussian 09
title: 000254462
version: EM64L-G09RevD.01
frameworkgroup: C1[X(C17H20N2O3)]
method: RPBEPBE
basis: SDD
operation: Freq
keyword: #p
keyword: freq=noraman
keyword: PBEPBE/SDD
title: #p freq=noraman PBEPBE/SDD
converged: YES YES NO NO
title: Mulliken charges:
elementType: O O O N N C C C C C C C C C C C C C C C C C H H H H H H H H H H H H H H H H H H H H
charge: -0.255216 -0.169337 -0.246001 -0.303450 -0.363868 0.211915 -0.479589 -0.502798 -0.433585 -0.434846 0.204787 0.058711 0.113367 0.173587 0.198618 -0.370847 -0.350709 -0.356858 -0.345885 -0.209459 -0.211391 -0.688269 0.207916 0.258539 0.279343 0.219824 0.206472 0.228913 0.252450 0.200837 0.350344 0.249918 0.204140 0.272079 0.270795 0.200078 0.227544 0.240413 0.240137 0.206535 0.220481 0.224367
chargesum: 0.00000
title: Mulliken charges with hydrogens summed into heavy atoms:
elementType: O O O N N C C C C C C C C C C C C C C C C C
charge: -0.255216 -0.169337 -0.246001 -0.303450 -0.013524 0.211915 -0.013134 -0.003630 0.001799 0.018441 0.204787 0.058711 0.113367 0.173587 0.198618 0.083211 -0.078630 -0.086063 0.081737 0.030953 0.028746 -0.036887
polarizability: 2.58578291e+02 -1.36925939e+01 1.83262260e+02 2.74168814e+00 3.09893395e+01 1.69018612e+02
1716.lowfreq: -14.2544 -4.9653 0.0007 0.0008 0.0009 7.5497 10.6252 32.2939 43.7338
frequency: -13.0936 32.2222 43.7233 63.1058 72.0983 79.8030 102.5653 124.1768 129.5748 141.6908 165.9352 179.9578 196.1620 233.5361 239.8733 257.6755 262.6651 273.4845 332.5113 348.8875 361.9069 368.5327 415.6230 448.0563 452.9181 482.6758 525.4944 556.2170 567.7855 618.2436 643.3001 657.1075 690.4615 690.9462 712.2186 734.0686 750.1497 763.0662 783.7675 786.5613 795.4162 799.1660 816.3317 854.2640 864.7317 870.9258 902.4703 907.7951 922.6383 966.0017 975.6509 976.9630 987.6125 1004.3191 1007.4724 1017.7055 1032.3116 1054.5236 1075.2847 1081.7988 1088.7005 1101.2696 1134.7290 1142.1773 1164.5469 1172.1469 1184.0792 1198.1725 1211.8659 1219.5052 1241.2891 1249.9800 1253.9257 1280.0371 1281.8593 1282.7529 1298.1034 1309.5624 1312.6397 1323.7478 1339.2731 1358.6177 1391.0256 1417.8933 1444.4948 1450.9546 1453.6891 1457.7246 1465.7575 1468.2754 1473.4286 1477.3550 1484.6085 1486.6561 1516.7416 1598.7639 1616.9771 1621.2681 1621.9799 1671.9472 2974.2298 2985.8883 2994.6106 3001.7970 3004.5761 3019.2261 3031.7102 3039.7653 3060.2884 3069.5175 3075.9509 3076.9809 3086.8302 3102.8504 3129.8713 3140.6853 3154.1344 3165.5838 3175.4082 3414.1569
redmass: 3.1705 4.4769 6.0264 3.1573 4.3680 2.7905 1.7864 3.3475 4.4736 4.7708 4.8016 6.8449 1.7812 1.6536 3.9103 3.9009 5.6728 6.0369 3.3324 6.1497 2.4938 5.1768 3.4662 4.0912 4.8216 2.5768 7.4488 9.4912 2.5011 4.5235 4.2667 4.7344 6.9234 6.2896 2.6946 2.0022 1.2983 1.4943 2.6627 4.9025 1.6537 1.6979 1.7880 6.0228 2.0525 3.1353 2.2732 1.3929 2.1412 2.3962 1.4112 1.9571 2.4167 2.2274 1.3505 2.3368 2.3009 2.1848 2.6589 2.6836 2.6826 2.1020 2.4117 2.6617 1.3513 2.0800 1.4687 2.1912 1.6642 1.6422 1.4492 1.2167 1.6628 1.4727 1.3924 1.2613 5.0041 1.3199 1.3889 1.4616 1.3956 1.2621 1.2278 6.8284 1.0962 1.1070 2.4652 2.7471 1.0726 1.0794 1.0885 1.0515 1.0665 1.0978 1.6295 10.1952 7.3110 7.9977 6.9393 12.6033 1.0361 1.0615 1.0642 1.0669 1.0615 1.0639 1.0675 1.0984 1.1006 1.0992 1.1008 1.1003 1.1024 1.0975 1.0987 1.0865 1.0906 1.0956 1.1004 1.0812
irintensity: 0.1554 0.8260 1.0917 1.4251 4.1088 1.3510 0.9951 1.5741 0.7452 1.0111 4.9241 2.5918 0.2295 0.4424 0.6056 3.7208 2.2840 3.5253 12.5538 12.4440 8.1018 0.6630 0.8421 2.7832 0.3704 1.4182 9.9594 1.2646 3.6059 10.1115 10.2876 2.7551 6.8361 6.7663 47.5560 74.7202 44.3520 66.5562 12.8002 2.3275 29.1331 20.6946 2.9154 15.6789 15.9145 3.8835 0.9930 0.0496 8.5994 6.7125 2.2270 3.7868 6.9810 3.5541 0.0594 4.2128 58.1423 26.5468 3.7087 0.4562 6.7773 0.7349 4.0972 11.3474 4.5725 4.2385 3.1730 4.8958 15.2637 34.0389 4.9161 1.5967 5.4357 44.9645 8.8892 22.6438 281.8229 14.9187 1.9837 8.9490 2.1752 1.7215 21.5573 14.4088 7.3489 22.0382 11.5815 0.4564 8.0747 8.7935 20.3684 7.7047 11.4177 9.4001 244.9578 139.7070 63.3592 5.1580 289.9882 78.9687 28.3632 29.7077 41.3469 17.8265 32.5442 59.2954 21.6154 11.1311 16.8108 48.5007 57.2991 30.9703 36.4913 19.4871 6.6028 1.8019 5.3726 4.9438 21.0566 129.2648
temp: 298.150 k
press: 1.00000 atm
elementType: 8 8 8 7 7 6 6 6 6 6 6 6 6 6 6 6 6 6 6 6 6 6 1 1 1 1 1 1 1 1 1 1 1 1 1 1 1 1 1 1 1 1
symmnumber: 1
zpe: 898244.3 jmol-1
zpe.correction: 0.342123 hartree
zpe.thermalcorrener: 0.361646 hartree
zpe.thermalcorrenthalpy: 0.362590 hartree
zpe.thermalcorrgfe: 0.293994 hartree
zpe.sumelectzpe: -993.413835 hartree
zpe.sumelectthermal: -993.394312 hartree
zpe.sumelectthermalent: -993.393368 hartree
zpe.sumelectthermalfe: -993.461964 hartree
dipole: -4.2161 1.3846 2.8599
dipole: 5.2794
quadrupole: -110.7185 -124.9030 -138.8200
quadrupole: 0.4794 7.2998 -4.1880
quadrupole: 14.0953 -0.0891 -14.0062 0.4794 7.2998 -4.1880
hfenergy: -993.7559578 hartree
pointgroup: C01 [X(C17H20N2O3)]
dipole: 1.2610539 1.0146037 -1.3017493 debye
polarizability: 235.5841259|38.6625183|198.3272603|8.9659048|-31.86936|176.9477778 unknown
InChI: InChI=1S/C17H20N2O3/c1-2-11-18-16(22)17(9-5-6-10-17)19-14(20)12-7-3-4-8-13(12)15(19)21/h3-4,7-8,18H,2,5-6,9-11H2,1H3
charge 0 multiplicity 1
42 atoms
O  -2.9019 -0.977296 1.687643
O  1.225487 -1.319944 1.987527
O  -0.494341 0.484039 -2.036147
N  0.077415 -0.739737 -0.056256
N  -2.78726 0.260465 -0.279689
C  -1.149742 -1.601561 0.028037
C  -1.490589 -2.262608 -1.348761
C  -0.966741 -2.849445 0.937159
C  -2.484641 -3.389221 -0.970405
C  -2.08168 -3.832466 0.476141
C  -2.357504 -0.73855 0.567218
C  1.152826 -0.685527 0.911983
C  0.310509 0.201237 -1.102408
C  2.147281 0.291814 0.363804
C  1.64662 0.813448 -0.84864
C  -3.890751 1.167218 0.086311
C  3.382438 0.703987 0.884799
C  2.358855 1.7691 -1.589091
C  -3.40932 2.491418 0.728931
C  4.117525 1.664813 0.141855
C  3.613956 2.188793 -1.076417
C  -2.578477 3.374242 -0.226693
H  -0.55424 -2.692542 -1.754641
H  -1.890171 -1.566046 -2.100286
H  -1.04979 -2.59438 2.002107
H  0.035369 -3.278425 0.759688
H  -2.441085 -4.219705 -1.696648
H  -3.519814 -3.001987 -0.980128
H  -2.945965 -3.76543 1.15719
H  -1.716085 -4.874218 0.499906
H  -2.266428 0.418949 -1.152744
H  -4.535912 0.622993 0.797644
H  -4.478767 1.384207 -0.8265
H  3.756298 0.297223 1.829496
H  1.955735 2.170302 -2.524032
H  -4.304582 3.049476 1.068678
H  -2.822966 2.248638 1.635481
H  5.087693 2.010524 0.514351
H  4.203208 2.93056 -1.625924
H  -3.16656 3.658275 -1.120479
H  -2.254526 4.305152 0.272957
H  -1.670979 2.847113 -0.575015
