program: Gaussian 09
title: 000254409
version: EM64L-G09RevD.01
frameworkgroup: C1[X(C6H7N5O4)]
method: RPBEPBE
basis: SDD
operation: Freq
keyword: #pfreq=noraman
keyword: PBEPBE/SDD
title: #p freq=noraman PBEPBE/SDD
converged: YES YES NO NO
title: Mulliken charges:
elementType: O O O O N N N N N C C C C C C H H H H H H H
charge: -0.244371 -0.203868 -0.200248 -0.271843 -0.062703 -0.091544 0.048725 -0.611302 -0.570769 0.100720 0.095118 0.197076 -0.014849 0.187377 -0.495904 0.335503 0.377471 0.341834 0.348518 0.234757 0.245410 0.254893
chargesum: 0.00000
title: Mulliken charges with hydrogens summed into heavy atoms:
elementType: O O O O N N N N N C C C C C C
charge: -0.244371 -0.203868 -0.200248 -0.271843 -0.062703 -0.091544 0.048725 0.101671 0.119583 0.100720 0.095118 0.197076 -0.014849 0.187377 0.239156
polarizability: 1.59784757e+02 1.09131241e+01 1.60876905e+02 5.29632126e+00 -2.46761289e+00 6.45842331e+01
1716.lowfreq: -5.3154 -0.0011 -0.0007 -0.0005 6.0795 6.3727 26.3943 69.0930 88.2176
frequency: 26.1973 69.0912 88.2165 97.0282 113.9493 141.4227 204.8356 213.2056 234.6732 253.0242 267.1901 302.0903 340.6000 343.9040 386.9399 409.2282 544.7440 546.2763 559.1811 566.2054 593.7708 630.5695 662.4156 673.5536 694.8673 723.2628 731.3448 744.6667 769.8478 801.6732 856.8887 929.7616 974.9545 1016.9226 1110.0820 1112.5593 1146.5310 1151.4052 1175.4361 1225.2459 1311.8382 1341.2968 1385.6603 1411.6657 1422.7142 1454.3572 1462.4322 1498.6567 1512.9315 1547.5181 1592.5408 1622.0518 1642.5729 3007.8791 3113.6601 3155.2998 3409.7769 3548.3801 3633.9306 3706.0721
redmass: 6.8071 4.6815 4.0833 4.6818 1.1984 10.7855 6.6636 7.6249 5.7160 5.1852 6.8867 6.5586 7.8613 3.1983 10.5090 4.8768 1.3831 3.1820 8.2534 1.0686 1.2867 8.4835 8.6462 5.6865 7.5066 7.9718 6.4512 1.1969 12.9097 7.6510 7.1276 5.0879 4.1765 2.8583 2.9830 1.4865 2.5175 1.4336 7.3203 9.4242 9.2830 8.0904 3.7155 4.5987 1.2999 1.0499 1.0512 3.2412 2.0569 3.1067 2.8413 1.9697 10.3004 1.0291 1.1052 1.1050 1.0527 1.0447 1.0979 1.1060
irintensity: 1.7730 4.3063 1.9697 3.1414 0.4414 0.3144 5.9042 1.7177 1.4099 3.4654 11.6832 2.3578 9.4624 31.0823 1.5320 1.3948 197.5038 32.8922 0.8743 19.3727 204.7732 13.1717 5.1899 16.2815 21.4959 1.7008 4.0061 92.6261 7.2064 65.9631 5.0358 4.3436 49.0412 62.4609 17.1205 6.6285 97.8462 5.1950 261.1347 287.5856 333.0257 6.1861 27.7455 28.9882 26.2368 12.4630 10.4728 56.7262 80.0498 337.5192 788.2763 365.1736 172.2558 31.7780 17.5038 13.9987 84.9571 190.9448 95.5253 59.8675
temp: 298.150 k
press: 1.00000 atm
elementType: 8 8 8 8 7 7 7 7 7 6 6 6 6 6 6 1 1 1 1 1 1 1
symmnumber: 1
zpe: 396053.6 jmol-1
zpe.correction: 0.150849 hartree
zpe.thermalcorrener: 0.164828 hartree
zpe.thermalcorrenthalpy: 0.165773 hartree
zpe.thermalcorrgfe: 0.109347 hartree
zpe.sumelectzpe: -806.326596 hartree
zpe.sumelectthermal: -806.312617 hartree
zpe.sumelectthermalent: -806.311673 hartree
zpe.sumelectthermalfe: -806.368098 hartree
dipole: -4.3177 -3.0538 -2.1935
dipole: 5.7253
quadrupole: -63.6811 -80.9784 -91.1364
quadrupole: -0.2152 -5.9721 1.1741
quadrupole: 14.9175 -2.3798 -12.5377 -0.2152 -5.9721 1.1741
hfenergy: -806.4774452 hartree
pointgroup: C01 [X(C6H7N5O4)]
dipole: 1.8143794 1.0777814 -0.7875478 debye
dipolederiv: -1.0678419 0.2110929 -0.3744445 0.2258476 -0.3269431 0.0632683 -0.6333003 0.167843 -0.9149193 -0.6507995 0.1582238 0.2436059 0.1710607 -0.3702455 -0.1068256 -0.1283356 -0.0543924 -0.8765417 -1.0842273 -0.1787317 0.0643384 0.0949238 -0.4927115 -0.0140352 0.0846573 0.0000813 -0.2073456 -0.4859451 0.2375733 0.0317587 0.0432465 -1.0834015 -0.0519738 0.0323061 -0.0811515 -0.2904458 -1.2764686 -0.6689543 0.0324293 -0.251835 -0.7458926 -0.0058412 0.0527256 0.0113919 -0.2243108 -0.5006393 -0.0245732 0.0081784 -0.0084916 -1.4091157 -0.0665554 0.0252583 -0.0757758 -0.2978135 1.5316945 0.3620428 -0.1005796 0.4130215 1.6632865 0.0593829 -0.1051736 0.064917 0.2275739 -0.6435368 0.4602215 0.0272896 0.5090308 -0.9933236 -0.0519347 0.0344735 -0.0529147 -0.6315726 -0.7157936 -0.7630399 -0.0472446 -0.6652746 -1.2531315 0.0084422 -0.0308665 0.0242766 -0.6637907 -0.8497483 -0.0680666 0.0564925 -0.5531179 -1.1031555 -0.0331133 0.000444 -0.0406636 0.0167897 0.433335 0.0425707 -0.0381268 0.3719966 1.1429957 0.0230425 0.0103475 0.0527356 0.0470008 1.0458376 -0.0843793 -0.0546873 -0.380781 1.3988207 0.0982815 -0.1065789 0.0723328 0.2618079 1.427031 0.7666344 -0.0262923 0.4659713 1.691855 0.063104 -0.0715349 0.0524633 0.2558699 1.1181055 -0.3158053 0.0897043 -0.4125913 0.5126529 0.0686403 0.6684346 -0.088177 1.4977655 0.6742303 -0.0995655 0.1636583 -0.0886865 0.257308 -0.0366033 0.1115641 -0.0137915 0.2509656 0.2396241 -0.0780851 0.0044942 -0.0676016 0.2330324 -0.0047987 0.0062836 -0.0023967 0.3686223 0.3362579 -0.0928511 -0.0041698 0.0134877 0.3044033 -0.0072311 0.0036985 0.0015854 0.3712797 0.2803646 0.1277098 0.0146705 0.0311385 0.1914958 -0.0146218 0.010821 -0.0225638 0.3853351 0.1659173 -0.0207572 0.0148802 0.0792893 0.3483036 -0.0071713 0.0167677 -0.0044806 0.3800135 0.044343 0.0141503 -0.0404915 0.010828 0.1147957 0.0121769 -0.0998014 0.0251458 -0.0901082 -0.0134706 0.0265329 -0.0382077 0.0728707 -0.0515441 -0.0586105 0.0554818 -0.1057706 0.0632514 -0.0082698 -0.0119431 -0.0272562 -0.0743334 -0.029485 0.0629773 0.0623275 0.0693056 0.0705727 unknown
polarizability: 161.762551|10.818353|158.9245002|-2.0414277|5.2806586|64.5588437 unknown
InChI: InChI=1S/C6H7N5O4/c1-15-5(12)2-3(11(13)14)4(7)10-6(8)9-2/h7-8H2,1H3
charge 0 multiplicity 1
22 atoms
O  -2.336835 0.878325 -0.936472
O  -2.279054 1.004582 1.399031
O  -1.80584 -1.763389 0.179491
O  0.009502 -3.110057 -0.116476
N  0.517293 1.666361 0.138694
N  2.53618 0.281263 -0.079802
N  -0.529441 -1.920795 0.027549
N  2.42584 -2.036856 -0.218038
N  2.645752 2.610895 0.056952
C  0.323467 -0.759952 0.020048
C  -0.236336 0.548725 0.130338
C  1.769154 -0.853545 -0.094666
C  1.89055 1.473352 0.038084
C  -1.726213 0.795667 0.300645
C  -3.808393 1.076679 -0.908452
H  3.442539 -2.014778 -0.286207
H  1.86736 -2.898624 -0.239139
H  3.658495 2.544294 -0.01109
H  2.175869 3.508811 0.149757
H  -4.100289 1.14587 -1.965068
H  -4.057835 2.000618 -0.360791
H  -4.284364 0.211854 -0.417187
