program: Gaussian 09
title: 000018113
version: EM64L-G09RevD.01
frameworkgroup: C1[X(C15H22N2O2)]
method: RPBEPBE
basis: SDD
operation: Freq
keyword: #p
keyword: freq=noraman
keyword: PBEPBE/SDD
title: #p freq=noraman PBEPBE/SDD
converged: YES YES NO NO
title: Mulliken charges:
elementType: O O N N C C C C C C C C C C C C C C C H H H H H H H H H H H H H H H H H H H H H H
charge: -0.246929 -0.264027 -0.087750 -0.611660 0.114383 -0.474278 -0.372615 -0.332641 -0.343508 0.324315 -0.795792 -0.329204 -0.320800 0.171828 -0.374060 -0.396077 -0.250741 -0.243336 -0.243153 0.259703 0.217135 0.190308 0.230833 0.186075 0.220574 0.210889 0.186930 0.255881 0.219864 0.227322 0.213927 0.191780 0.191302 0.211595 0.244707 0.254170 0.346107 0.328203 0.229926 0.227466 0.231347
chargesum: 0.00000
title: Mulliken charges with hydrogens summed into heavy atoms:
elementType: O O N N C C C C C C C C C C C C C C C
charge: -0.246929 -0.264027 -0.087750 0.062650 0.114383 0.002560 0.048527 0.074007 0.054312 0.324315 -0.092725 0.076503 0.082098 0.171828 -0.129353 -0.141907 -0.020814 -0.015870 -0.011806
polarizability: 1.81908051e+02 2.19005358e+01 1.91109338e+02 -4.02388136e+00 1.30493956e+00 1.52584904e+02
1716.lowfreq: -1.9557 0.0005 0.0007 0.0008 3.8992 8.8228 29.9573 34.4585 35.7594
frequency: 27.4680 34.1759 35.3781 52.4064 65.0953 87.5074 118.9608 155.9080 187.2009 204.7430 217.9528 239.9083 259.2031 299.5478 308.7838 313.7879 330.5635 363.4201 386.4669 400.4901 405.4506 420.8215 453.9071 470.9026 497.8904 548.3916 573.3715 601.0197 603.3666 609.5881 617.6641 695.8172 707.3336 736.8068 762.8522 767.0402 784.6512 809.0256 837.7996 842.0044 857.2555 898.9211 913.1739 932.4657 980.2832 989.8768 992.1319 997.0548 1001.0428 1027.3850 1029.7626 1050.1943 1055.0303 1062.7778 1073.7264 1080.8766 1093.7444 1104.2073 1121.2533 1134.8683 1144.5709 1152.0256 1174.5197 1191.0662 1198.5010 1203.8327 1245.8262 1262.2211 1272.5371 1290.3338 1304.2023 1308.5304 1316.3382 1323.8792 1331.6808 1343.9573 1365.5397 1370.8165 1373.3672 1384.9252 1392.3763 1433.1165 1443.0823 1447.1899 1450.0970 1458.6758 1468.4937 1480.7399 1484.0672 1484.3850 1490.2518 1572.0190 1585.6244 1609.8093 1629.9967 2847.5463 2851.0202 2865.5252 2952.5786 2956.5010 2987.6409 3007.3554 3012.0858 3023.0199 3048.1940 3071.7766 3077.7354 3080.7871 3081.6861 3097.1996 3123.3736 3130.6002 3143.6708 3155.2342 3167.1936 3508.2508 3662.9285
redmass: 3.0893 4.4745 4.5727 4.8165 4.5302 4.4284 3.6316 3.7316 3.8928 3.1923 2.9878 1.8022 3.0733 1.9425 1.5251 2.1649 2.9556 4.3480 2.3339 2.9279 2.8092 3.2434 4.3077 2.8170 3.3408 1.1902 2.5211 1.3666 3.1567 2.0390 6.0668 4.0753 1.6372 4.7766 2.9321 2.1934 1.4117 3.6249 2.1466 1.6076 1.2488 2.4064 1.9979 1.6700 1.3965 6.0592 1.9720 1.3110 2.2477 2.4597 2.1555 2.8465 1.9026 1.9230 2.1133 2.3021 2.6966 2.1202 2.2889 2.4565 2.8296 2.8868 1.0543 1.0706 1.1209 1.6912 1.4177 1.4280 1.4526 1.2493 1.3524 1.4744 2.1793 1.6826 1.2790 1.2684 1.4089 1.2798 6.1666 1.2213 1.4392 2.2359 1.0818 1.0830 1.0952 1.0927 1.0819 1.1190 1.0829 1.9055 1.0882 1.5473 5.2098 5.8535 3.4573 1.0699 1.0711 1.0686 1.0664 1.0665 1.0355 1.0626 1.0851 1.0891 1.0887 1.1009 1.0964 1.0994 1.0977 1.1000 1.0848 1.0876 1.0931 1.0948 1.1004 1.0442 1.1044
irintensity: 0.0627 1.3468 1.8216 6.3794 0.6147 0.6815 0.4180 2.3643 0.4825 1.7904 5.9563 1.3215 3.2450 2.5627 0.0900 8.7427 3.3917 12.2414 2.3542 1.6997 0.1847 6.1619 3.2991 0.7766 4.7560 128.7981 27.7045 51.7131 3.1804 26.5004 2.4117 1.9603 54.5217 19.2683 17.5701 10.7664 7.9433 30.9275 3.9638 0.3612 0.6426 6.5115 6.2964 9.7870 0.7958 0.1187 20.4207 0.5981 18.0246 12.0025 8.7467 13.7877 9.4048 2.5682 9.1162 19.6331 27.7657 4.6089 18.1535 34.3776 9.7444 9.9901 0.0720 1.9616 0.6331 4.5513 26.5902 3.3900 3.2110 3.9381 28.0945 23.9653 72.2282 35.9527 9.9365 12.7135 2.7318 2.3498 1.0810 23.4146 3.1515 8.9479 2.4563 5.4327 15.7599 6.3201 2.0484 19.0351 7.5649 19.6267 9.4314 120.5830 3.2019 31.7415 232.8458 35.4102 43.6236 170.3593 30.9180 103.8939 21.4696 9.2023 12.1040 47.6654 32.0080 18.8145 42.6389 44.5879 30.2391 19.2934 2.9727 1.7118 23.4473 29.3853 15.3723 25.9201 44.3035
temp: 298.150 k
press: 1.00000 atm
elementType: 8 8 7 7 6 6 6 6 6 6 6 6 6 6 6 6 6 6 6 1 1 1 1 1 1 1 1 1 1 1 1 1 1 1 1 1 1 1 1 1 1
symmnumber: 1
zpe: 915569.1 jmol-1
zpe.correction: 0.348722 hartree
zpe.thermalcorrener: 0.367289 hartree
zpe.thermalcorrenthalpy: 0.368233 hartree
zpe.thermalcorrgfe: 0.300745 hartree
zpe.sumelectzpe: -843.276050 hartree
zpe.sumelectthermal: -843.257484 hartree
zpe.sumelectthermalent: -843.256539 hartree
zpe.sumelectthermalfe: -843.324027 hartree
dipole: -4.2680 -2.8155 0.4240
dipole: 5.1306
quadrupole: -117.7359 -119.4875 -108.8395
quadrupole: 4.4631 1.0739 1.4317
quadrupole: -2.3816 -4.1332 6.5148 4.4631 1.0739 1.4317
hfenergy: -843.6247722 hartree
pointgroup: C01 [X(C15H22N2O2)]
dipole: -1.7138095 1.0568964 -0.1423539 debye
polarizability: 183.297509|-22.5373952|189.1041012|3.2589279|3.5092914|153.2006827 unknown
InChI: InChI=1S/C15H22N2O2/c1-15(14(16)18,13-5-3-2-4-6-13)7-8-17-9-11-19-12-10-17/h2-6H,7-12,16H2,1H3
charge 0 multiplicity 1
41 atoms
O  5.322971 0.492913 0.274155
O  -1.283313 -3.426339 0.214804
N  2.432122 0.222164 0.036619
N  -3.208929 -2.176502 0.497828
C  -1.211874 -1.076294 -0.567168
C  0.262391 -1.036612 -0.037528
C  1.135099 0.065013 -0.67137
C  3.335466 -0.946507 -0.134011
C  3.133595 1.467114 -0.373699
C  -1.949968 0.236418 -0.238344
C  -1.212214 -1.411631 -2.0901
C  4.62494 -0.739911 0.676885
C  4.42087 1.64358 0.447515
C  -1.893064 -2.32068 0.104669
C  -1.989856 0.706266 1.106407
C  -2.605363 1.015857 -1.227345
C  -2.650461 1.90557 1.445198
C  -3.269377 2.219737 -0.892172
C  -3.29533 2.67184 0.445034
H  0.685786 -2.041524 -0.210185
H  0.266503 -0.877105 1.056779
H  1.296027 -0.143277 -1.76018
H  0.604066 1.033675 -0.598929
H  3.599067 -1.100186 -1.212355
H  2.829477 -1.85971 0.226562
H  2.462794 2.32962 -0.197184
H  3.397955 1.451776 -1.462368
H  -0.64147 -2.341292 -2.252647
H  -2.236226 -1.573059 -2.473307
H  -0.742874 -0.606498 -2.681374
H  5.343127 -1.556857 0.496635
H  4.376015 -0.691283 1.759133
H  4.161534 1.75728 1.522506
H  4.994066 2.522405 0.108044
H  -1.496493 0.128281 1.896406
H  -2.598948 0.691058 -2.272102
H  -3.682578 -1.27498 0.458059
H  -3.690665 -2.989906 0.880699
H  -2.662577 2.243063 2.487761
H  -3.764033 2.802026 -1.677935
H  -3.807258 3.604697 0.705804
