program: Gaussian 09
title: 000254467
version: EM64L-G09RevD.01
frameworkgroup: C1[X(C20H28N2O5)]
method: RPBEPBE
basis: SDD
operation: Freq
keyword: #p
keyword: freq=noraman
keyword: PBEPBE/SDD
title: #p freq=noraman PBEPBE/SDD
converged: YES YES NO NO
title: Mulliken charges:
elementType: O O O O O N N C C C C C C C C C C C C C C C C C C C C H H H H H H H H H H H H H H H H H H H H H H H H H H H H
charge: -0.273441 -0.292781 -0.289190 -0.256894 -0.244168 -0.459947 -0.396500 0.262603 -0.521856 -0.584845 -0.420888 -0.427443 0.189141 -0.160850 -0.034971 0.275137 0.182877 -0.733412 -0.707523 -0.475500 0.472285 -0.499505 -0.366948 -0.390787 -0.229222 -0.225663 -0.233158 0.271862 0.255644 0.263428 0.236657 0.228329 0.211836 0.219519 0.221018 0.333520 0.345291 0.294155 0.222454 0.218382 0.222752 0.232692 0.251445 0.228257 0.207256 0.223017 0.242790 0.241477 0.244082 0.236582 0.271632 0.232903 0.229005 0.227453 0.230011
chargesum: 0.00000
title: Mulliken charges with hydrogens summed into heavy atoms:
elementType: O O O O O N N C C C C C C C C C C C C C C C C C C C C
charge: -0.273441 -0.292781 -0.289190 -0.256894 -0.244168 -0.126427 -0.051209 0.262603 0.005651 -0.084760 0.019277 0.013094 0.189141 0.133304 0.187482 0.275137 0.182877 -0.059585 -0.020565 -0.009693 0.472285 0.222636 -0.095316 -0.157884 -0.000218 0.001789 -0.003146
polarizability: 2.90250666e+02 -1.12226403e+01 2.12783756e+02 1.07830830e+00 1.25088812e+01 2.16942250e+02
1716.lowfreq: -15.1907 -11.5362 -6.1589 -0.0009 -0.0004 0.0003 1.9089 13.0494 18.2599
frequency: -9.7291 13.0283 18.0952 27.7536 30.7291 38.8257 42.5019 59.9207 61.8166 69.2896 75.3978 82.6638 97.0143 110.8746 121.7569 140.1248 153.8548 179.6534 187.1148 200.8342 222.3365 226.9766 236.8253 242.5614 255.4322 292.5394 305.0663 313.3251 334.4367 341.0188 350.2108 393.5646 397.5562 401.9723 404.7749 456.3425 486.4260 549.9565 572.4876 588.2888 608.4299 617.3991 624.8810 629.7416 656.4950 666.9990 694.4292 697.4658 703.9474 710.3689 723.4662 756.9140 773.3926 806.4398 815.4381 822.7299 832.4656 859.5615 863.2802 883.7118 887.6278 920.3113 926.4193 935.7231 941.2662 958.0498 958.9044 963.8123 977.9295 979.7295 983.8845 990.4959 1001.1278 1005.5222 1027.1202 1036.1472 1051.3883 1056.4037 1084.4208 1091.0050 1112.1016 1117.1093 1120.8592 1137.8524 1150.1079 1173.1546 1173.3968 1180.3175 1184.3928 1189.8563 1192.4728 1210.1007 1213.9319 1221.5396 1225.0860 1237.2071 1249.5207 1265.5939 1281.3458 1293.8866 1305.5881 1313.7224 1321.1860 1323.9897 1331.1016 1342.3216 1345.3119 1383.6525 1385.2463 1402.7912 1422.6679 1441.8818 1452.1186 1452.2818 1459.8216 1461.3679 1463.1807 1470.5824 1473.6174 1477.6625 1478.0732 1480.5851 1484.4948 1486.2797 1493.4301 1495.7220 1594.2562 1601.2578 1614.7504 1633.1024 1650.5684 2973.5020 2981.2717 2996.9280 2997.4899 3005.4255 3006.5165 3017.4094 3029.3072 3031.9029 3032.6331 3048.8692 3067.9820 3069.8517 3072.7922 3078.6304 3083.4729 3087.8205 3103.1543 3108.2858 3109.1883 3119.3806 3127.9027 3140.2414 3151.3075 3152.7748 3164.9976 3534.2317 3541.2984
redmass: 4.1644 4.9655 4.6958 4.2055 4.3280 5.0810 3.3385 1.9897 1.9499 2.3544 2.4916 3.1783 7.7796 3.4209 4.4074 3.9320 5.6013 3.4485 4.1594 1.1090 3.8901 1.7657 2.3763 2.8297 4.6325 4.4673 3.2505 4.4828 3.9926 3.1376 3.5164 2.6502 2.9901 3.4442 2.9764 3.8761 4.0429 2.4287 1.4127 3.7831 3.8613 6.0845 3.1501 2.5314 1.5419 4.3816 4.3735 5.9282 1.9622 6.1822 2.6783 2.4275 2.4074 1.8763 3.4908 1.9793 3.6842 1.3041 4.8874 2.6140 5.4457 2.5681 1.2526 1.5068 2.1155 2.2692 1.7196 2.1671 2.8094 2.1658 1.4502 5.5191 1.3331 3.2601 2.2083 1.8584 2.2094 2.1900 1.9825 1.5290 1.3421 2.5869 2.7044 3.9596 1.4464 2.1274 1.0557 1.8228 1.7669 1.1287 1.8786 1.7005 1.7429 2.8244 1.2728 1.1588 1.6831 1.3041 1.2990 1.4379 1.4023 1.3886 1.5584 1.5775 1.2542 1.4286 1.2347 1.2037 7.9478 1.2038 1.1903 2.1735 1.4933 1.0503 1.0609 1.1568 1.0512 1.1671 1.1943 1.1515 1.1004 1.0583 1.8801 1.6396 1.0786 1.1474 6.0735 9.5062 6.0525 9.1152 8.2816 1.0356 1.0358 1.0605 1.0839 1.0616 1.0295 1.0632 1.0831 1.0648 1.0590 1.1004 1.1000 1.1025 1.0994 1.0991 1.1027 1.1002 1.1039 1.1068 1.1047 1.0868 1.0872 1.0920 1.0963 1.1049 1.1016 1.0765 1.0768
irintensity: 0.1860 0.1716 0.2165 2.0925 1.4991 1.0747 0.5512 0.1351 0.2976 0.5381 3.0737 0.7716 7.3282 1.6962 0.6586 3.6076 2.0200 7.4419 1.2772 0.2006 4.8554 4.1692 6.6034 4.0162 3.0484 24.7031 6.3725 6.6297 20.6381 3.0755 0.6342 5.2448 11.9192 0.5327 0.2321 9.2930 17.5192 34.5936 31.6767 14.9551 3.3988 0.4584 5.8048 19.8174 170.6458 8.6725 6.2173 0.4855 43.8236 14.1150 35.1895 48.1033 31.2026 4.5492 9.6821 6.1076 3.9756 0.2902 11.3953 4.1334 8.7689 46.1385 3.5777 4.1396 2.0374 4.5551 2.9587 93.3229 58.3648 54.3810 14.2110 1.5168 0.5683 27.1553 5.9153 25.8139 66.7569 15.8388 7.9512 7.3012 1.9713 8.2473 11.8211 197.2389 14.3303 67.9293 0.2485 156.1364 8.2311 0.2391 8.3409 114.8387 13.0481 25.1432 10.0722 7.0930 38.7003 33.0425 2.5910 109.5881 13.3477 10.0469 33.3307 4.9806 2.1376 8.3594 12.5045 22.1558 0.7204 9.8765 21.7901 10.5031 287.8215 12.3644 12.6913 41.8455 11.9738 51.8022 67.2786 12.0302 34.4008 8.8629 80.8947 133.2628 18.2249 14.0045 1.6300 188.3868 0.3380 112.2997 205.2923 23.8611 21.5684 11.4990 14.5805 54.7023 34.6527 47.5293 19.3271 2.6300 32.1108 5.4891 34.2608 12.3582 5.5759 62.3341 45.2388 24.4402 18.7339 6.2481 24.2161 5.7384 1.6098 18.5683 25.0173 14.7922 22.9030 41.0936 28.1033
temp: 298.150 k
press: 1.00000 atm
elementType: 8 8 8 8 8 7 7 6 6 6 6 6 6 6 6 6 6 6 6 6 6 6 6 6 6 6 6 1 1 1 1 1 1 1 1 1 1 1 1 1 1 1 1 1 1 1 1 1 1 1 1 1 1 1 1
symmnumber: 1
zpe: 1192767.8 jmol-1
zpe.correction: 0.454301 hartree
zpe.thermalcorrener: 0.482111 hartree
zpe.thermalcorrenthalpy: 0.483055 hartree
zpe.thermalcorrgfe: 0.391857 hartree
zpe.sumelectzpe: -1262.535210 hartree
zpe.sumelectthermal: -1262.507401 hartree
zpe.sumelectthermalent: -1262.506456 hartree
zpe.sumelectthermalfe: -1262.597654 hartree
dipole: -0.6548 -1.4165 -2.7268
dipole: 3.1417
quadrupole: -134.2648 -155.6775 -161.3450
quadrupole: -12.3038 -4.7064 -3.4336
quadrupole: 16.1643 -5.2484 -10.9159 -12.3038 -4.7064 -3.4336
hfenergy: -1262.9895111 hartree
pointgroup: C01 [X(C20H28N2O5)]
dipole: 0.2870613 0.4958601 -1.0952391 debye
polarizability: 277.3588832|-30.3842789|224.5969781|-11.3168703|-8.5469966|218.0208115 unknown
InChI: InChI=1S/C20H28N2O5/c1-14(2)16(17(23)26-3)21-18(24)20(11-7-8-12-20)22-19(25)27-13-15-9-5-4-6-10-15/h4-6,9-10,14,16,21-22H,7-8,11-13H2,1-3H3
charge 0 multiplicity 1
55 atoms
O  -2.846716 -1.452543 1.299511
O  1.626625 0.479564 -1.656081
O  0.98402 0.275017 0.610289
O  -5.189275 2.610178 -0.119459
O  -3.621052 2.092782 -1.761943
N  -0.115702 -0.876651 -1.131867
N  -2.300526 0.386022 -0.02033
C  -1.019973 -1.72863 -0.318473
C  -0.238146 -2.63094 0.678691
C  -1.6611 -2.789965 -1.265686
C  0.379302 -3.748444 -0.203015
C  -0.580948 -3.902307 -1.432117
C  -2.127665 -0.911441 0.402223
C  -3.316535 1.266184 0.557158
C  -2.734338 2.291837 1.600884
C  0.839395 -0.032751 -0.602903
C  -4.026529 2.001483 -0.579035
C  -1.721667 3.269567 0.960251
C  -2.094093 1.537099 2.787745
C  2.752826 1.383723 -1.238896
C  4.032229 0.607476 -1.012017
C  -5.945516 3.401821 -1.122227
C  4.29478 0.009403 0.248452
C  4.983011 0.467745 -2.054629
C  5.485786 -0.720353 0.45656
C  6.175877 -0.260551 -1.846781
C  6.429109 -0.85683 -0.589505
H  0.50602 -2.057826 1.254356
H  -0.979826 -3.036662 1.38826
H  -2.551594 -3.188959 -0.750452
H  -1.99873 -2.353303 -2.224565
H  1.391146 -3.46036 -0.541197
H  0.483251 -4.691282 0.362165
H  -1.055002 -4.89909 -1.463062
H  -0.024641 -3.784521 -2.38025
H  -0.049424 -1.057406 -2.136003
H  -1.74779 0.733279 -0.807705
H  -4.043031 0.623508 1.088786
H  -3.608669 2.867479 1.965437
H  -1.378933 4.002422 1.712951
H  -2.154827 3.833026 0.112819
H  -0.82869 2.725047 0.600069
H  -1.193031 0.988374 2.459524
H  -2.793995 0.807423 3.23201
H  -1.789339 2.254758 3.571831
H  2.83868 2.080864 -2.08714
H  2.433152 1.918845 -0.327855
H  -5.30373 4.190121 -1.5499
H  -6.301558 2.743929 -1.932447
H  -6.7867 3.831691 -0.561399
H  3.557065 0.113906 1.0521
H  4.786758 0.928709 -3.030757
H  5.681105 -1.178101 1.432776
H  6.905142 -0.360537 -2.658482
H  7.35451 -1.420526 -0.425471
