program: Gaussian 09
title: 000250354
version: EM64L-G09RevD.01
frameworkgroup: C1[X(C12H7BrN2O5)]
method: RPBEPBE
basis: SDD
operation: Freq
keyword: #p
keyword: freq=noraman
keyword: PBEPBE/SDD
title: #p freq=noraman PBEPBE/SDD
converged: YES YES NO NO
title: Mulliken charges:
elementType: Br O O O O O N N C C C C C C C C C C C C H H H H H H H
charge: 0.056822 -0.260360 -0.197064 -0.167299 -0.195271 -0.200180 0.012177 0.023424 0.253457 0.385094 0.249444 -0.473449 -0.312849 0.400292 -0.377410 -0.259849 -0.167367 -0.235440 -0.375761 -0.154732 0.322358 0.282547 0.279241 0.305526 0.263904 0.293309 0.249439
chargesum: 0.00000
title: Mulliken charges with hydrogens summed into heavy atoms:
elementType: Br O O O O O N N C C C C C C C C C C C C
charge: 0.056822 -0.260360 -0.197064 -0.167299 -0.195271 -0.200180 0.012177 0.023424 0.253457 0.385094 0.249444 -0.151091 -0.030303 0.400292 -0.098169 0.045677 0.096537 -0.235440 -0.082452 0.094706
polarizability: 2.79589830e+02 1.26658466e+01 1.87247104e+02 -2.96790055e+01 -6.69380849e+00 1.13129183e+02
1716.lowfreq: -5.3135 -0.0009 -0.0008 -0.0007 2.8539 4.4617 21.2925 25.1785 34.9658
frequency: 21.1878 25.1043 34.9414 41.7922 61.0358 95.0048 136.6783 142.0945 167.2903 179.2544 194.8387 219.8418 282.4615 302.3048 327.9798 347.9915 377.4139 409.5261 422.8209 430.5324 493.7639 506.3732 516.8160 546.6234 604.7954 625.0391 648.2896 663.7396 671.6658 681.5674 704.4967 726.0616 741.8273 780.4982 813.3474 823.0907 831.3504 905.8980 911.4890 919.8983 937.7386 962.7335 987.1668 996.1225 1061.7968 1074.5442 1079.4185 1081.7392 1154.7534 1166.6732 1175.4727 1200.0566 1214.8940 1232.5288 1253.3875 1280.0916 1350.1080 1373.1986 1376.8407 1397.4546 1401.3949 1438.6030 1455.4665 1466.9865 1567.8224 1589.4098 1591.4849 1614.0786 3160.4722 3161.8538 3179.6061 3181.3661 3181.8905 3187.4229 3194.3189
redmass: 8.7382 8.8957 12.8133 14.6038 11.1532 7.6810 14.1807 5.9486 6.0252 6.9222 11.1340 6.5235 8.0847 7.4596 9.6451 8.0615 8.9674 7.1410 4.0267 3.4011 7.5658 4.1605 5.7634 6.8446 6.4425 6.6124 7.6505 5.3934 4.7878 4.9641 4.6787 6.5010 6.8941 9.4578 1.4572 1.4190 8.1716 2.1772 2.2784 1.5227 1.3999 1.3420 6.1938 1.3420 3.0599 1.8179 2.9910 1.5125 1.5863 1.2017 2.5436 10.3341 10.7289 4.1820 1.4101 1.3599 4.3097 11.1915 10.6032 7.2828 5.9324 3.3202 2.5451 2.6775 8.5779 6.8677 7.2039 7.6340 1.0886 1.0888 1.0929 1.0948 1.0959 1.0930 1.0975
irintensity: 0.5419 3.0633 1.1833 0.1954 0.6289 0.6341 2.5981 0.3468 0.3923 1.0064 4.0589 1.7802 3.0810 2.3559 1.7526 0.5194 1.3104 1.8069 1.5573 1.6535 6.8489 19.8569 6.4813 3.6249 9.1074 12.3952 2.1062 17.6073 13.3303 13.2170 35.3345 5.5742 20.3817 41.4635 41.2942 42.3836 18.0087 21.0722 16.4333 17.1912 8.4497 0.4657 2.2944 1.6779 41.1077 5.4950 78.9148 23.7054 3.2876 5.0795 14.8527 417.8336 236.1864 304.8811 49.5032 39.3741 11.5502 93.0663 90.8933 5.7775 24.0772 15.0515 504.1981 40.8815 23.9686 18.1795 18.5127 41.0418 9.2165 2.1714 4.7893 0.6028 1.5657 7.7407 4.0459
temp: 298.150 k
press: 1.00000 atm
elementType: 35 8 8 8 8 8 7 7 6 6 6 6 6 6 6 6 6 6 6 6 1 1 1 1 1 1 1
symmnumber: 1
zpe: 454973.5 jmol-1
zpe.correction: 0.173290 hartree
zpe.thermalcorrener: 0.190532 hartree
zpe.thermalcorrenthalpy: 0.191477 hartree
zpe.thermalcorrgfe: 0.124138 hartree
zpe.sumelectzpe: -958.962429 hartree
zpe.sumelectthermal: -958.945187 hartree
zpe.sumelectthermalent: -958.944243 hartree
zpe.sumelectthermalfe: -959.011582 hartree
dipole: 0.8810 -0.5769 -4.8720
dipole: 4.9845
quadrupole: -121.4570 -143.7809 -125.2262
quadrupole: 20.2753 -10.2527 -0.5277
quadrupole: 8.6977 -13.6262 4.9285 20.2753 -10.2527 -0.5277
hfenergy: -959.1357197 hartree
pointgroup: C01 [X(C12H7Br1N2O5)]
dipole: -0.3552608 -0.0140894 1.9285704 debye
polarizability: 273.88662|-27.0006648|193.6494288|-27.8930803|4.1042352|112.4300685 unknown
InChI: InChI=1S/C12H7BrN2O5/c13-8-4-5-12(11(6-8)15(18)19)20-10-3-1-2-9(7-10)14(16)17/h1-7H
charge 0 multiplicity 1
27 atoms
Br 5.008111 -2.521696 0.448447
O  0.142523 1.293166 0.509556
O  3.353849 2.016443 -1.982673
O  1.849124 3.037529 -0.603782
O  -4.829173 -2.049685 -0.571896
O  -2.707338 -2.582296 -1.217883
N  2.528934 2.01445 -0.985299
N  -3.562277 -1.816879 -0.626836
C  1.214679 0.393137 0.482086
C  -1.200966 0.849985 0.598233
C  2.396478 0.744091 -0.229077
C  -1.670098 -0.313854 -0.04326
C  1.191026 -0.833385 1.190921
C  -3.051484 -0.586856 0.03928
C  -2.079851 1.72361 1.278118
C  3.513492 -0.122672 -0.252714
C  2.306173 -1.691536 1.188691
C  3.462012 -1.329985 0.45961
C  -3.96134 0.253376 0.714904
C  -3.456439 1.418896 1.330665
H  -1.018958 -0.988404 -0.605246
H  0.298743 -1.112534 1.758327
H  -1.672251 2.626849 1.740407
H  4.389935 0.173686 -0.834024
H  2.274562 -2.628091 1.751886
H  -5.021514 -0.008522 0.743214
H  -4.138353 2.094579 1.855442
