program: Gaussian 09
title: 000254372
version: EM64L-G09RevD.01
frameworkgroup: C1[X(C4H3ClFN3)]
method: RPBEPBE
basis: SDD
operation: Freq
keyword: #p
keyword: freq=noraman
keyword: PBEPBE/SDD
title: #p freq=noraman PBEPBE/SDD
converged: YES YES NO YES
title: Mulliken charges:
elementType: Cl F N N N C C C C H H H
charge: 0.012989 -0.193019 0.025283 0.054490 -0.614974 0.170379 0.204915 -0.316625 -0.308304 0.270853 0.346508 0.347504
chargesum: 0.00000
title: Mulliken charges with hydrogens summed into heavy atoms:
elementType: Cl F N N N C C C C
charge: 0.012989 -0.193019 0.025283 0.054490 0.079038 0.170379 0.204915 -0.045772 -0.308304
polarizability: 1.08700364e+02 -5.59379195e+00 7.89491024e+01 -4.96399420e-03 -1.02779419e-03 2.90027030e+01
1716.lowfreq: -5.8820 -3.6030 -0.0006 0.0020 0.0032 9.5469 100.7329 201.1528 243.5651
frequency: 100.7308 201.1524 243.5650 262.4628 342.7780 370.5438 422.5559 468.9616 509.3639 537.0880 555.4134 622.4807 658.0051 741.0541 763.2097 891.8741 906.3522 999.7601 1135.1917 1165.8921 1270.4762 1306.1706 1337.3341 1453.5347 1530.7601 1568.5899 1630.4275 3169.4359 3546.4413 3698.4002
redmass: 14.1717 6.7895 6.1655 7.1708 7.9873 22.4016 3.0508 4.7794 1.0933 8.1035 1.2519 8.5416 11.2909 8.0928 8.6635 5.2412 1.4406 2.6131 4.4432 3.4776 4.3806 1.9262 6.9424 5.8140 5.6718 2.4968 1.8627 1.0937 1.0450 1.1053
irintensity: 0.1421 5.1103 3.3003 7.6536 0.1521 1.5167 14.0032 14.0262 120.8105 1.6402 201.5672 42.6131 1.7076 1.0633 12.9497 29.2035 16.9011 40.3804 0.2414 188.1038 108.1489 67.5372 137.3331 137.0957 1.4265 95.1321 456.2142 6.8299 135.2785 60.8752
temp: 298.150 k
press: 1.00000 atm
elementType: 17 9 7 7 7 6 6 6 6 1 1 1
symmnumber: 1
zpe: 193854.9 jmol-1
zpe.correction: 0.073835 hartree
zpe.thermalcorrener: 0.081473 hartree
zpe.thermalcorrenthalpy: 0.082417 hartree
zpe.thermalcorrgfe: 0.041117 hartree
zpe.sumelectzpe: -877.724659 hartree
zpe.sumelectthermal: -877.717022 hartree
zpe.sumelectthermalent: -877.716078 hartree
zpe.sumelectthermalfe: -877.757378 hartree
dipole: -4.2738 1.9729 0.0007
dipole: 4.7072
quadrupole: -59.1853 -51.7642 -58.6090
quadrupole: -4.7746 -0.0017 0.0039
quadrupole: -2.6658 4.7553 -2.0894 -4.7746 -0.0017 0.0039
hfenergy: -877.7984947 hartree
pointgroup: C01 [X(C4H3Cl1F1N3)]
dipole: -1.7461075 -0.6129326 0.0722239 debye
dipolederiv: -0.8385423 0.1586098 0.0654327 0.2222535 -0.1491846 -0.0218866 0.0703513 -0.017498 -0.0689022 -1.0701601 0.2842796 0.0861418 0.245965 -0.2552905 -0.0263153 0.0834387 -0.0291263 -0.1389888 -1.1285015 -0.3609755 0.0360738 -0.2323813 -0.5378871 -0.0104278 0.0465507 -0.0020206 -0.1949039 -0.8715616 -0.0267672 0.0455395 0.5339777 -0.7105346 -0.0774503 0.0884337 -0.0390045 -0.1872188 -0.830567 -0.638614 -0.0408951 -0.7194801 -0.8671757 0.037241 -0.0480484 0.0308754 -0.705832 0.9710043 0.6891057 0.0031738 0.9690761 1.0860581 -0.0006011 0.0248449 0.0193448 0.2318427 0.8945835 -0.3137753 -0.0782528 -0.7156581 -0.2970754 0.0181344 -0.1095348 -0.0091496 0.1114495 0.4968585 0.1837833 -0.022344 -0.064957 0.3843535 0.0365693 -0.0413082 0.0197199 -0.0310053 1.8311555 -0.11148 -0.1324735 -0.4076885 0.8747996 0.092925 -0.1552092 0.0726142 0.0434171 0.0801176 0.0459951 0.0081776 0.0795554 0.0007683 -0.0167684 0.0108867 -0.0145165 0.14661 0.2902012 0.0818528 0.0139839 0.0251266 0.1835897 -0.0187641 0.0097659 -0.0224906 0.400918 0.1754119 0.0079859 0.0154424 0.0642106 0.2875786 -0.0126561 0.0198287 -0.0087481 0.3926138 unknown
polarizability: 109.1387809|2.9526372|77.8782256|-5.2571692|3.551169|29.6351631 unknown
InChI: InChI=1S/C4H3ClFN3/c5-4-8-1-2(6)3(7)9-4/h1H,7H2
charge 0 multiplicity 1
12 atoms
Cl 3.12259 -0.53106 -0.275976
F  -2.543642 0.981203 0.228615
N  0.49739 -1.069835 -0.136508
N  1.148092 1.275822 -0.001757
N  -1.765451 -1.728714 -0.033673
C  -0.826941 -0.733631 -0.01988
C  -1.179341 0.64529 0.109157
C  -0.181022 1.616116 0.115216
C  1.382339 -0.049927 -0.119334
H  -0.421012 2.679109 0.213233
H  -2.755927 -1.513277 0.050521
H  -1.451174 -2.692496 -0.129315
