program: Gaussian 09
title: 000250353
version: EM64L-G09RevD.01
frameworkgroup: C1[X(C12H8N2O6)]
method: RPBEPBE
basis: SDD
operation: Freq
keyword: #p
keyword: freq=noraman
keyword: PBEPBE/SDD
title: #p freq=noraman PBEPBE/SDD
converged: YES YES NO NO
title: Mulliken charges:
elementType: O O O O O O N N C C C C C C C C C C C C H H H H H H H H
charge: -0.252572 -0.427858 -0.190641 -0.164301 -0.203130 -0.196404 0.010445 0.020436 0.219754 0.288264 -0.477225 -0.268575 0.429899 0.388736 -0.380597 -0.482255 -0.403712 0.332599 -0.149251 -0.406092 0.332607 0.287098 0.294858 0.292260 0.271959 0.238722 0.231170 0.363808
chargesum: 0.00000
title: Mulliken charges with hydrogens summed into heavy atoms:
elementType: O O O O O O N N C C C C C C C C C C C C
charge: -0.252572 -0.064050 -0.190641 -0.164301 -0.203130 -0.196404 0.010445 0.020436 0.219754 0.288264 -0.144619 0.018523 0.429899 0.388736 -0.085739 -0.189996 -0.131754 0.332599 0.089471 -0.174922
polarizability: 2.69182513e+02 -1.97355635e+00 1.74559461e+02 1.96771026e+01 -5.74891681e+00 1.08640239e+02
1716.lowfreq: -7.1174 -3.7017 -0.0008 0.0002 0.0003 4.9009 18.0729 27.9591 40.2204
frequency: 18.0537 27.8095 40.2175 53.0751 57.7330 96.4441 143.6224 149.7019 173.6767 224.2482 228.9179 270.6400 306.2259 312.9801 345.3936 367.1127 373.0188 425.9761 445.4661 453.6314 489.1368 512.8069 515.9756 539.2283 568.3154 614.4843 640.9371 656.8146 672.9949 682.5053 709.6644 715.3026 746.3136 756.5884 780.2982 793.0623 840.7417 871.6051 878.3437 880.0324 935.0295 951.9151 965.4212 983.5103 990.2398 1053.9444 1079.1250 1108.8543 1114.1224 1144.2416 1153.6502 1174.0238 1202.9106 1216.4682 1238.5019 1253.0287 1264.4874 1291.0840 1359.3095 1374.6139 1392.2708 1401.3935 1429.3762 1457.1967 1465.9393 1474.6310 1584.4981 1600.5458 1608.2142 1621.0753 3129.6778 3160.0880 3170.5526 3176.6834 3188.1588 3188.2750 3190.1377 3586.2407
redmass: 5.8320 7.0717 13.6316 8.0729 14.6740 7.4952 12.4561 5.9720 7.8997 4.4910 6.1248 7.5389 8.9050 8.8855 10.2473 1.1128 6.9900 4.1527 3.9748 3.4616 5.5573 6.9790 5.6119 7.5374 5.2778 7.6659 7.2858 6.8293 5.9902 2.4860 6.2588 6.5834 4.6526 11.0665 1.5247 6.6066 1.4891 1.4517 3.2476 2.0415 3.9608 1.4783 1.3198 6.1063 1.3433 2.2294 1.5981 1.9058 3.1547 1.3216 1.4391 1.1409 10.0994 7.4644 3.2809 1.6124 3.6252 1.3628 6.6782 11.6437 8.3397 9.0689 6.6276 2.6485 2.8879 2.7565 9.0116 7.1499 7.2575 6.4909 1.0895 1.0929 1.0891 1.0931 1.0952 1.0950 1.0962 1.0662
irintensity: 0.5117 0.5627 0.5952 0.1269 0.1060 4.8080 3.4765 1.9650 2.7948 0.1830 2.5780 0.7738 0.4353 4.3952 0.2087 141.2473 2.2511 3.1651 7.9704 5.5013 6.6454 1.1378 4.6791 1.2479 1.3518 6.6689 5.4485 31.1841 10.7704 12.6268 12.3233 21.4131 7.1603 21.7405 56.1885 4.7493 34.6558 4.8952 4.7932 36.2799 156.2207 22.7169 1.5116 13.8024 1.0184 41.5507 25.5616 66.0996 70.2324 51.7754 126.0906 14.9241 342.8124 362.1652 258.7318 11.6282 100.2619 30.9325 90.8619 73.0446 3.5333 63.6539 20.9532 193.8885 97.1478 42.9093 45.3825 208.3703 133.6578 60.5191 9.8820 14.1188 0.4407 0.2580 8.9384 6.3448 7.1864 53.9815
temp: 298.150 k
press: 1.00000 atm
elementType: 8 8 8 8 8 8 7 7 6 6 6 6 6 6 6 6 6 6 6 6 1 1 1 1 1 1 1 1
symmnumber: 1
zpe: 490819.0 jmol-1
zpe.correction: 0.186943 hartree
zpe.thermalcorrener: 0.203923 hartree
zpe.thermalcorrenthalpy: 0.204867 hartree
zpe.thermalcorrgfe: 0.139281 hartree
zpe.sumelectzpe: -1021.316859 hartree
zpe.sumelectthermal: -1021.299879 hartree
zpe.sumelectthermalent: -1021.298935 hartree
zpe.sumelectthermalfe: -1021.364521 hartree
dipole: -8.6992 -3.4074 -1.8737
dipole: 9.5288
quadrupole: -108.2103 -131.6568 -112.4835
quadrupole: 14.3733 0.6142 -4.3207
quadrupole: 9.2399 -14.2066 4.9668 14.3733 0.6142 -4.3207
hfenergy: -1021.5038016 hartree
pointgroup: C01 [X(C12H8N2O6)]
dipole: 3.2708873 1.8076531 -0.2967102 debye
polarizability: 269.8637479|10.9536467|172.4269935|-11.0344581|14.492635|110.0914715 unknown
InChI: InChI=1S/C12H8N2O6/c15-9-2-1-3-10(7-9)20-12-5-4-8(13(16)17)6-11(12)14(18)19/h1-7,15H
charge 0 multiplicity 1
28 atoms
O  1.058162 -0.949182 -0.332015
O  3.864725 1.989693 2.317087
O  -2.059296 -3.399284 0.534701
O  -0.215247 -3.285705 -0.807618
O  -4.362711 2.441404 -0.216166
O  -5.188656 0.317572 -0.057601
N  -1.177723 -2.7447 -0.148522
N  -4.215243 1.158938 -0.156991
C  -0.207199 -0.390393 -0.301655
C  -1.330231 -1.268925 -0.195013
C  -2.640743 -0.765644 -0.127317
C  -0.444965 1.009491 -0.37257
C  -2.837292 0.623747 -0.207372
C  2.231244 -0.134615 -0.194431
C  -1.749955 1.518445 -0.336357
C  2.458523 0.586072 0.992108
C  3.173106 -0.20301 -1.239454
C  3.681219 1.283846 1.121324
C  4.388101 0.500365 -1.082294
C  4.649719 1.248512 0.086443
H  -3.488812 -1.446116 -0.015645
H  0.405716 1.689825 -0.461344
H  -1.945154 2.591707 -0.403763
H  1.736232 0.600682 1.812741
H  2.957753 -0.799587 -2.129025
H  5.139232 0.464052 -1.877606
H  5.597646 1.789837 0.193949
H  4.753049 2.424072 2.346903
