program: Gaussian 09
title: 000254479
version: EM64L-G09RevD.01
frameworkgroup: C1[X(C22H26N2O5)]
method: RPBEPBE
basis: SDD
operation: Freq
keyword: #p
keyword: freq=noraman
keyword: PBEPBE/SDD
title: #p freq=noraman PBEPBE/SDD
converged: YES YES NO NO
title: Mulliken charges:
elementType: O O O O O N N C C C C C C C C C C C C C C C C C C C C C C H H H H H H H H H H H H H H H H H H H H H H H H H H
charge: -0.264525 -0.262565 -0.243742 -0.214468 -0.175474 -0.307025 -0.467874 0.192618 0.317851 -0.503394 -0.479584 -0.429368 -0.438978 -0.511255 -0.515861 0.184933 -0.413948 -0.418426 0.153190 0.098789 0.057962 0.195940 0.174171 -0.356322 -0.353189 -0.255590 -0.212564 -0.210914 -0.665574 0.222383 0.280149 0.207047 0.267249 0.242868 0.202237 0.207523 0.224627 0.224532 0.277736 0.225619 0.281540 0.396635 0.214576 0.229100 0.228938 0.211305 0.271320 0.270870 0.223383 0.237660 0.238516 0.238700 0.253750 0.226629 0.220291
chargesum: 0.00000
title: Mulliken charges with hydrogens summed into heavy atoms:
elementType: O O O O O N N C C C C C C C C C C C C C C C C C C C C C C
charge: -0.264525 -0.262565 -0.243742 -0.214468 -0.175474 -0.307025 -0.071239 0.192618 0.317851 -0.000861 -0.005287 0.015736 -0.006828 -0.008987 -0.008701 0.184933 0.029728 0.021817 0.153190 0.098789 0.057962 0.195940 0.174171 -0.085002 -0.082319 0.205452 0.025952 0.027787 0.035096
polarizability: 2.88225999e+02 -2.39225177e+01 2.79230276e+02 2.57405689e+01 1.60840549e+01 2.17196766e+02
1716.lowfreq: -30.2846 -14.1343 -8.0305 -3.6202 -0.0008 -0.0003 0.0008 4.1342 23.4279
frequency: -29.8916 -12.2087 22.8996 26.5731 39.2568 44.7558 54.8353 65.3641 69.8838 93.0599 106.4870 120.0045 126.4682 127.9194 142.1223 147.0376 174.3874 189.8838 211.3808 218.5890 229.8105 252.4153 256.8608 262.3453 286.3276 312.8905 329.5237 350.8419 357.7115 373.7602 402.6511 416.8285 438.5663 445.6711 452.4380 525.6299 534.5254 555.9769 591.9050 607.2129 628.3722 638.3760 657.0958 670.4052 690.6753 694.2392 713.0545 721.0140 737.1686 753.9192 768.1560 780.9757 784.6566 788.3427 796.5574 800.2237 814.7128 817.5710 819.5109 844.2936 855.3947 874.1306 885.4631 905.8836 907.2095 919.1161 968.1296 968.2682 974.7302 983.4804 995.6458 1004.3842 1006.3717 1017.8172 1023.3074 1032.5711 1048.4809 1054.3279 1073.1788 1076.1885 1084.3035 1087.9894 1096.5560 1106.9850 1140.2747 1145.2393 1156.3994 1163.7851 1172.1706 1181.9751 1198.1086 1199.9738 1202.4000 1214.2325 1214.8471 1228.9774 1233.8347 1248.3835 1264.1105 1277.4594 1280.9441 1282.5243 1292.6165 1296.2061 1303.0062 1308.6133 1312.4296 1314.5468 1323.4122 1342.0326 1359.8910 1391.9455 1417.2382 1445.2120 1454.1932 1454.6095 1455.7492 1457.2026 1462.1615 1463.0386 1465.2118 1466.3971 1475.4880 1482.8115 1484.0804 1485.9117 1487.6778 1588.7225 1615.0497 1616.8299 1620.4515 1622.3707 1672.3025 2993.4994 3000.4390 3003.8077 3006.6774 3014.2297 3015.1795 3019.4994 3029.3025 3030.4137 3031.7328 3056.6163 3057.9331 3074.4281 3081.9946 3087.9453 3088.7258 3095.0798 3098.7318 3108.2938 3120.9562 3131.9296 3139.3145 3153.3677 3165.2937 3174.6921 3364.9173
redmass: 2.6858 3.4927 3.6918 3.1260 3.3687 2.6678 4.5372 4.1498 3.6174 3.7547 3.6494 6.4954 4.5879 3.1358 4.3304 5.0871 6.5775 2.2303 3.2789 1.6150 3.0272 2.6871 4.4527 6.3423 5.0663 2.8937 5.2148 7.0132 5.0954 4.5139 3.8527 3.9617 4.0063 4.3292 4.8989 7.3659 3.1524 9.4753 2.7807 3.1233 3.4365 6.7009 4.7160 3.7718 7.3392 6.1038 2.9172 4.3316 2.1816 2.3739 1.2700 1.4646 2.0426 3.2198 1.7198 1.6791 2.2650 1.5567 2.6770 4.1728 5.6422 2.7637 2.5686 2.6492 1.3969 2.5703 2.3034 2.6321 1.4120 1.6144 3.3397 2.2730 1.3465 2.3383 2.1352 2.2880 1.6605 2.3261 3.3230 2.9399 2.5609 4.6115 2.2895 3.4095 3.4287 2.5219 1.7866 1.3442 2.0723 1.4475 1.8214 1.6166 1.3985 1.5028 1.8680 1.4927 1.1583 1.3678 1.7959 1.1200 1.5106 1.3597 1.2807 6.1853 1.3396 1.4201 1.3675 1.3397 1.4525 1.3630 1.4218 1.2318 6.8947 1.0936 2.4758 1.1019 1.0802 2.7379 1.1179 1.0511 1.0819 1.0807 1.0975 1.2432 1.0524 1.1983 1.3341 8.9858 9.1145 7.2149 7.9736 9.1646 12.6512 1.0361 1.0623 1.0676 1.0587 1.0596 1.0635 1.0605 1.0685 1.0641 1.0597 1.1036 1.0998 1.1044 1.1027 1.0984 1.1031 1.1030 1.1048 1.0969 1.1064 1.0976 1.0864 1.0906 1.0956 1.1003 1.0799
irintensity: 0.1592 0.0900 0.2619 0.7110 0.4027 0.3535 2.4520 0.4617 0.7121 2.1802 1.9890 6.6274 0.6921 0.5472 4.0921 2.1612 2.1909 2.6584 0.6016 1.8617 1.2597 2.2558 1.8803 1.5655 1.9448 19.8157 6.9345 12.8400 4.6890 10.3247 3.9733 5.9714 5.6546 3.6800 0.2353 10.2622 5.9796 2.3560 4.8974 15.9195 0.8559 18.0373 2.3943 26.8434 2.5297 14.1847 50.9132 10.2208 9.4342 31.4756 93.1344 2.3256 22.1033 20.4393 25.6374 0.8717 2.4172 2.5958 11.1914 7.3759 13.3152 4.5509 14.0995 3.2908 0.0408 19.6202 9.9325 9.6644 2.2810 3.5213 4.4412 25.1538 0.0026 0.5901 38.3494 56.9163 4.1374 46.4983 0.7955 3.7405 8.3399 10.3445 32.3761 39.3443 67.1812 183.7835 60.3740 5.0244 1.7269 3.7144 5.5855 1.0749 0.6658 2.9291 13.4655 19.2339 0.6114 40.7590 51.2547 5.8460 13.6623 6.3239 0.7531 333.1321 16.6470 12.9787 4.2855 2.6337 10.8135 12.3748 7.9332 27.4123 14.5580 7.4444 10.3640 13.8159 4.4267 0.2474 52.1483 27.8789 13.1944 8.8243 32.5173 100.5327 16.8639 71.8032 190.8662 104.4067 225.2620 77.1530 3.2503 206.9584 60.2816 17.9007 29.9087 17.3860 6.2677 45.9412 57.6331 71.4710 27.8885 17.4787 30.9192 1.2455 16.5347 8.3091 54.3298 29.6960 9.7402 1.7446 45.4137 15.7354 28.1184 5.2719 2.0284 6.4044 5.2916 22.5919 95.5059
temp: 298.150 k
press: 1.00000 atm
elementType: 8 8 8 8 8 7 7 6 6 6 6 6 6 6 6 6 6 6 6 6 6 6 6 6 6 6 6 6 6 1 1 1 1 1 1 1 1 1 1 1 1 1 1 1 1 1 1 1 1 1 1 1 1 1 1
symmnumber: 1
zpe: 1170678.0 jmol-1
zpe.correction: 0.445888 hartree
zpe.thermalcorrener: 0.471637 hartree
zpe.thermalcorrenthalpy: 0.472581 hartree
zpe.thermalcorrgfe: 0.388930 hartree
zpe.sumelectzpe: -1337.470581 hartree
zpe.sumelectthermal: -1337.444832 hartree
zpe.sumelectthermalent: -1337.443888 hartree
zpe.sumelectthermalfe: -1337.527539 hartree
dipole: -0.3923 -4.3897 -1.2210
dipole: 4.5732
quadrupole: -138.8743 -158.9452 -176.8658
quadrupole: -6.6861 0.4234 -10.9963
quadrupole: 19.3542 -0.7168 -18.6374 -6.6861 0.4234 -10.9963
hfenergy: -1337.9164691 hartree
pointgroup: C01 [X(C22H26N2O5)]
dipole: -0.2924908 -1.7053529 -0.4933861 debye
polarizability: 283.0892741|-24.7114743|283.245242|28.1034298|13.6753034|218.318525 unknown
InChI: InChI=1S/C22H26N2O5/c1-2-29-20(28)21(11-5-6-12-21)23-19(27)22(13-7-8-14-22)24-17(25)15-9-3-4-10-16(15)18(24)26/h3-4,9-10,23H,2,5-8,11-14H2,1H3
charge 0 multiplicity 1
55 atoms
O  -0.418911 2.292003 1.310353
O  -4.188016 -1.28902 0.15088
O  -2.47495 -1.288444 -1.421326
O  0.904308 -1.090926 -1.739891
O  3.369267 1.084531 1.662251
N  1.996055 0.371698 -0.188958
N  -1.045471 0.551987 -0.113326
C  1.192546 1.609347 -0.453739
C  -2.372447 0.287725 0.490998
C  1.937286 2.911586 -0.040051
C  0.953921 1.851071 -1.98057
C  1.264923 4.042597 -0.872674
C  0.504184 3.331654 -2.039619
C  -2.296982 -0.113761 2.004832
C  -3.315329 1.544914 0.503359
C  -0.170447 1.513873 0.336093
C  -3.650101 0.305126 2.644222
C  -4.33079 1.305458 1.649562
C  -2.986677 -0.832162 -0.368854
C  1.794649 -0.86625 -0.877352
C  3.00855 0.222214 0.829036
C  2.806042 -1.824274 -0.339894
C  3.52627 -1.176764 0.687268
C  3.065163 -3.157557 -0.692169
C  4.536531 -1.836168 1.402912
C  -4.88871 -2.359075 -0.632653
C  4.089977 -3.833702 0.019742
C  4.814216 -3.183049 1.051659
C  -5.724133 -1.749599 -1.76072
H  3.003837 2.806896 -0.307772
H  1.870629 3.089897 1.041215
H  1.92496 1.721683 -2.4968
H  0.237933 1.159377 -2.446776
H  0.565413 4.61708 -0.242456
H  2.025495 4.747872 -1.252032
H  0.722996 3.777586 -3.025655
H  -0.588878 3.402166 -1.886818
H  -2.073903 -1.187124 2.13324
H  -1.469956 0.468046 2.444441
H  -3.794364 1.71213 -0.477855
H  -2.674474 2.41262 0.731908
H  -0.784728 -0.047509 -0.913371
H  -3.477959 0.769754 3.631373
H  -4.29946 -0.573108 2.795987
H  -5.26239 0.865267 1.25608
H  -4.593055 2.259755 2.140393
H  2.493865 -3.649052 -1.485733
H  5.083262 -1.324197 2.200918
H  -5.512464 -2.85886 0.125274
H  -4.12842 -3.056608 -1.025339
H  4.325614 -4.874397 -0.227321
H  5.597563 -3.731696 1.585545
H  -5.076891 -1.269399 -2.513223
H  -6.435412 -1.002865 -1.367082
H  -6.304038 -2.54565 -2.263713
