program: Gaussian 09
title: 000254371
version: EM64L-G09RevD.01
frameworkgroup: C1[X(C8H11ClN2O2)]
method: RPBEPBE
basis: SDD
operation: Freq
keyword: #p
keyword: freq=noraman
keyword: PBEPBE/SDD
title: #p freq=noraman PBEPBE/SDD
converged: NO YES NO NO
title: Mulliken charges:
elementType: Cl O O N N C C C C C C C C H H H H H H H H H H H
charge: -0.016367 -0.237537 -0.209237 -0.116864 -0.005647 -0.224054 0.343630 -0.223511 0.037570 -0.252950 -0.673885 -0.676284 -0.266185 0.226307 0.226310 0.220623 0.220631 0.210543 0.234925 0.234932 0.207112 0.234871 0.234884 0.270184
chargesum: 0.00000
title: Mulliken charges with hydrogens summed into heavy atoms:
elementType: Cl O O N N C C C C C C C C
charge: -0.016367 -0.237537 -0.209237 -0.116864 -0.005647 0.228563 0.343630 0.217743 0.037570 -0.252950 0.006514 0.000583 0.004000
polarizability: 1.68519061e+02 -3.55558617e+00 1.32671858e+02 -1.71221932e-04 1.32369285e-03 6.49455085e+01
1716.lowfreq: -14.9273 0.0014 0.0016 0.0016 3.2299 6.2477 37.5382 46.1106 76.1022
frequency: 34.9212 46.1021 76.0898 86.5209 107.9372 133.4922 135.1354 221.3160 223.5871 243.9639 251.2332 291.1194 304.5074 316.7208 388.0623 452.9259 467.0106 519.9174 591.9353 676.1541 683.3938 711.6894 764.3871 800.0341 805.0277 839.9823 893.0124 913.7491 952.8716 1016.1441 1025.8060 1052.3750 1110.6422 1116.9651 1133.2801 1134.7355 1244.1442 1245.8918 1249.0422 1254.3656 1285.0560 1320.8944 1332.4611 1385.9302 1395.0043 1401.8646 1407.9135 1461.0489 1461.5267 1470.0184 1472.5994 1484.3615 1487.4821 1511.7518 1527.1999 2997.1385 2997.4985 3002.8829 3009.5904 3062.4989 3070.0239 3094.5736 3094.8077 3111.2673 3111.6966 3156.1911
redmass: 2.2878 4.6882 1.9301 3.4662 2.8191 5.5545 3.3922 2.8258 5.7150 1.2158 1.6677 4.7236 3.2395 11.0559 5.6226 3.6494 7.1211 5.3590 7.9200 7.8694 10.7187 6.2299 11.1976 1.0963 1.0956 3.5553 3.9607 1.4089 8.8641 2.4353 2.6262 5.9921 2.2481 2.3243 1.4462 1.4435 3.0164 1.1403 1.1412 5.1649 5.2126 2.0508 1.4253 2.4021 1.3865 1.4385 1.8864 1.0401 1.0399 1.0988 1.0739 1.1168 1.0786 5.1281 7.6732 1.0377 1.0361 1.0556 1.0576 1.1071 1.1070 1.0984 1.0984 1.1022 1.1026 1.0937
irintensity: 0.1452 0.4406 0.2095 0.0866 3.8089 2.4325 4.4246 0.8743 4.7633 0.0723 3.4985 4.9104 1.8128 0.2753 6.1821 0.5049 1.7729 2.7837 0.5219 28.1717 0.8411 7.6644 17.5885 3.4819 5.3879 3.7628 55.1412 13.2442 60.3296 20.1622 141.6809 52.3212 3.2412 19.6409 1.1113 8.2596 191.5103 0.0048 0.0061 66.5029 20.8134 319.6646 159.2219 112.9804 207.6320 29.4856 100.9386 10.3102 14.0445 17.7537 15.6571 22.6664 6.4421 242.3839 119.6578 34.9756 8.9822 18.7451 21.2507 14.4841 10.2278 12.3830 39.2735 24.9619 52.4520 6.9915
temp: 298.150 k
press: 1.00000 atm
elementType: 17 8 8 7 7 6 6 6 6 6 6 6 6 1 1 1 1 1 1 1 1 1 1 1
symmnumber: 1
zpe: 482271.3 jmol-1
zpe.correction: 0.183687 hartree
zpe.thermalcorrener: 0.197480 hartree
zpe.thermalcorrenthalpy: 0.198424 hartree
zpe.thermalcorrgfe: 0.141570 hartree
zpe.sumelectzpe: -1030.448496 hartree
zpe.sumelectthermal: -1030.434703 hartree
zpe.sumelectthermalent: -1030.433759 hartree
zpe.sumelectthermalfe: -1030.490613 hartree
dipole: -0.8933 4.3484 0.0001
dipole: 4.4392
quadrupole: -84.1485 -78.5174 -82.9338
quadrupole: -6.6705 -0.0002 0.0002
quadrupole: -2.2819 3.3492 -1.0673 -6.6705 -0.0002 0.0002
hfenergy: -1030.632183 hartree
pointgroup: C01 [X(C8H11Cl1N2O2)]
dipole: 0.1346853 -1.7413322 0.0004646 debye
dipolederiv: -0.7512134 0.2491856 0.0009909 0.2309002 -0.1422811 -0.0002955 0.0010113 -0.000332 -0.0202528 -0.6987032 -0.6749764 0.000853 -0.6611536 -1.5166801 0.0014088 0.0008304 0.0013963 -0.2912976 -1.7785527 0.6417386 0.0018981 0.7179658 -0.6507585 -0.0008714 0.0016835 -0.000722 -0.3001162 -1.2173502 -0.1565607 0.0015512 -0.1950896 -0.4925832 0.0003782 0.0015615 0.0003716 -0.1746775 -0.9730065 -0.0114844 0.0010928 0.6440735 -0.6205029 -0.0007505 0.0008303 0.0001687 -0.2300996 0.2627054 0.0129058 0.0001228 0.3041929 1.0477602 -0.0006991 -0.0000119 -0.0002863 0.3353998 0.8679102 0.8142776 -0.0012392 0.6448152 1.3644199 -0.0013707 -0.0011665 -0.0015681 0.2277486 0.6679208 -0.2568687 -0.0003561 -0.6596666 0.6568372 0.0007973 -0.000233 0.0002339 0.3462322 2.1677094 -0.536502 -0.0026079 -0.5331127 0.6597443 0.0005759 -0.0024003 0.0004938 0.2062253 0.7559672 -0.4568005 -0.0010938 -0.6796856 -0.5317487 0.0011729 -0.0010213 0.0008592 -0.0881662 -0.0386478 -0.0887904 0.0001111 -0.1151716 -0.0691823 0.0002081 0.0001112 0.000131 0.059501 -0.1476687 0.0450879 0.0002874 0.0744006 0.0437071 -0.0001227 0.0002452 -0.0000616 0.0590247 0.604008 0.2704032 -0.0010063 0.0316106 0.4022547 -0.0002031 -0.0009161 -0.0005611 -0.012175 0.0066754 0.0611823 0.0945517 -0.0504693 -0.0554206 0.0058895 0.101339 -0.0270716 -0.058654 0.0061377 0.0611866 -0.0947839 -0.0505808 -0.0554135 -0.0057504 -0.1014824 0.0269015 -0.0581371 -0.0069893 -0.0331877 0.0863375 0.0894524 -0.0455165 0.049741 0.0743144 0.0845409 -0.0661099 -0.0074742 -0.0335517 -0.0864908 0.0891929 -0.0456117 -0.0500011 -0.0745688 -0.0844404 -0.0654463 0.0584674 0.0578132 0.0000982 0.0179468 -0.1572819 0.0000113 0.0001066 -0.0000401 0.1165079 0.0107093 -0.020389 0.0877382 0.0458172 0.1127482 -0.0527252 0.1063885 -0.0243085 -0.057491 0.0101741 -0.0203092 -0.0879107 0.0459852 0.112798 0.052549 -0.1065669 0.0243434 -0.0569155 0.0246115 0.058691 0.0001103 0.1091777 -0.1377091 0.0000082 0.000086 0.0000836 0.115116 0.0504384 -0.0195974 0.0480654 -0.0861755 0.0719867 0.0913132 0.0827201 0.0806804 -0.0586371 0.0500614 -0.019923 -0.0483766 -0.0865938 0.0717563 -0.0912121 -0.0829262 -0.0807897 -0.0579574 0.0761098 0.0564693 0.0000567 0.0721681 -0.0233223 -0.0000516 0.0000653 -0.0000229 0.1303777 unknown
polarizability: 167.0752811|-7.8934582|134.1154169|-0.1466923|-0.0151337|64.9457294 unknown
InChI: InChI=1S/C8H11ClN2O2/c1-3-12-7-6(9)5-10-8(11-7)13-4-2/h5H,3-4H2,1-2H3
charge 0 multiplicity 1
24 atoms
Cl -3.147642 1.879351 0.0040
O  -1.983397 -0.94201 0.003288
O  2.551158 0.393474 -0.003743
N  0.298822 -0.312185 -0.000297
N  0.938115 2.040956 -0.002132
C  -1.532636 -2.369301 0.003239
C  -1.015393 0.028802 0.001522
C  2.926193 -1.05192 -0.003718
C  1.212195 0.704979 -0.002094
C  -1.410336 1.394886 0.001582
C  -2.802193 -3.213223 0.005251
C  4.450497 -1.092958 -0.006168
C  -0.389027 2.362126 -0.000279
H  -0.908848 -2.537492 -0.89312
H  -0.90644 -2.53679 0.898047
H  2.489639 -1.529723 0.892533
H  2.486707 -1.530531 -0.898097
H  -2.533766 -4.285494 0.004935
H  -3.411501 -3.005543 0.900922
H  -3.414148 -3.005682 -0.888644
H  4.794151 -2.143624 -0.005964
H  4.855294 -0.59218 -0.901726
H  4.858169 -0.590901 0.887369
H  -0.636114 3.428584 -0.000307
