program: Gaussian 09
title: 000254396
version: EM64L-G09RevD.01
frameworkgroup: C1[X(C17H14N4O)]
method: RPBEPBE
basis: SDD
operation: Freq
keyword: #p
keyword: freq=noraman
keyword: PBEPBE/SDD
title: #p freq=noraman PBEPBE/SDD
converged: YES YES NO NO
title: Mulliken charges:
elementType: O N N N N C C C C C C C C C C C C C C C C C H H H H H H H H H H H H H H
charge: -0.323926 -0.084700 -0.121814 -0.629031 -0.609459 0.254340 -0.138497 0.201661 -0.022663 0.340524 0.085820 -0.394530 -0.375295 -0.378168 -0.369330 0.145638 -0.216629 -0.223582 -0.241285 -0.237700 -0.240705 -0.245238 0.262855 0.258147 0.265602 0.247298 0.234825 0.234566 0.234489 0.226455 0.225256 0.227214 0.326410 0.385576 0.359194 0.336681
chargesum: 0.00000
title: Mulliken charges with hydrogens summed into heavy atoms:
elementType: O N N N N C C C C C C C C C C C C C C C C C
charge: -0.323926 -0.084700 -0.121814 0.082955 0.086416 0.254340 -0.138497 0.201661 -0.022663 0.340524 0.085820 -0.131675 -0.117148 -0.112566 -0.122033 0.145638 0.018196 0.010984 -0.006797 -0.011245 -0.015449 -0.018024
polarizability: 2.90288364e+02 1.90976368e+01 2.45389971e+02 1.55511922e+01 -1.28837288e+01 1.35153964e+02
1716.lowfreq: -4.1968 -0.0008 -0.0005 -0.0002 4.6717 7.5006 36.1527 43.0950 47.6427
frequency: 36.1465 43.0851 47.6051 66.0036 77.6957 83.3156 109.1207 125.0565 186.2626 218.2253 240.7973 261.4469 280.6707 316.7536 327.2110 371.6122 394.1778 400.7889 404.6735 432.5642 480.0039 497.5699 516.5629 558.9482 568.4683 572.8460 602.0092 606.3053 612.5585 617.3790 628.6797 652.1657 662.2143 700.2544 704.8744 722.5288 732.1967 750.5320 768.0924 773.6172 803.5673 827.7851 850.0600 860.4769 907.0936 924.2297 929.7950 976.2212 982.0394 987.6271 989.0746 993.6890 994.4116 1001.3212 1022.4493 1030.0793 1060.7332 1073.0129 1081.8179 1082.4067 1120.1107 1168.0461 1172.1982 1174.5355 1190.0332 1192.0574 1203.7576 1275.1819 1313.1197 1320.2490 1350.2467 1366.0257 1376.2501 1387.6501 1411.4711 1429.4842 1437.5248 1463.9354 1469.9486 1489.4745 1491.2975 1570.2884 1578.8087 1582.2330 1584.8611 1606.4840 1610.9822 1621.2630 3124.1623 3128.2971 3133.5850 3135.6445 3144.7935 3151.6702 3154.1310 3163.1225 3168.8316 3170.8311 3390.2672 3500.9231 3625.7049 3655.5636
redmass: 6.5148 4.9348 4.1926 4.4078 6.0682 4.5249 5.6087 6.1514 5.1000 5.9454 5.5700 4.4173 4.9462 5.4457 4.9849 4.6255 6.0616 2.8348 2.9118 6.1414 3.4618 3.2470 3.1810 1.4530 1.7038 2.1356 4.0311 1.6850 5.9740 6.1038 4.2378 5.2789 5.2435 1.7814 1.8925 4.3889 4.3355 1.2835 2.2174 2.0029 5.6401 5.4599 1.2484 1.2483 6.3103 1.4516 1.4059 1.4053 1.5216 4.5027 5.0824 3.8405 1.3460 1.3230 2.8123 2.0566 2.1288 2.5427 1.7521 1.6690 2.6918 6.5034 1.0548 1.0582 1.1566 1.1317 3.5279 4.6089 1.4063 1.4026 4.1972 5.8587 6.4325 4.9903 3.3628 2.2974 2.3683 2.5905 3.7685 2.8398 3.5054 1.7831 5.8665 3.5730 4.3229 6.0088 5.8941 1.7769 1.0848 1.0855 1.0878 1.0890 1.0926 1.0938 1.0967 1.0949 1.1017 1.0996 1.0537 1.0455 1.0966 1.1046
irintensity: 0.4328 0.7459 0.6954 0.1439 3.5507 0.2614 4.2457 1.6438 0.8608 1.2373 2.1884 2.0120 4.3221 4.9790 10.9593 5.1713 3.4447 0.1035 0.1284 2.5362 1.7626 0.2367 5.2598 82.2789 32.4725 41.1955 83.3948 161.2979 6.3084 4.0045 28.3420 15.8293 4.4649 43.9093 56.8845 1.4694 11.8076 126.4633 60.1595 20.8667 23.0124 8.4031 0.4374 0.8830 0.4205 2.7239 3.2147 0.8637 0.5568 0.1324 0.7219 27.1503 0.2930 0.4303 15.3884 2.9961 9.5837 6.7373 10.8591 3.4653 11.2176 126.7342 0.1739 0.6195 1.5052 2.6254 10.3445 7.0702 0.7703 0.8507 30.1359 0.0828 8.5204 136.9407 32.4642 10.2361 8.7637 62.8941 11.3371 43.5120 21.0686 93.7063 4.1766 315.5942 257.9353 10.3796 1.4063 176.7858 0.4158 1.5806 0.3204 11.8168 10.3145 35.1596 21.8311 20.1096 19.4132 11.1185 198.6925 57.5202 88.4751 76.6865
temp: 298.150 k
press: 1.00000 atm
elementType: 8 7 7 7 7 6 6 6 6 6 6 6 6 6 6 6 6 6 6 6 6 6 1 1 1 1 1 1 1 1 1 1 1 1 1 1
symmnumber: 1
zpe: 724542.0 jmol-1
zpe.correction: 0.275963 hartree
zpe.thermalcorrener: 0.294036 hartree
zpe.thermalcorrenthalpy: 0.294980 hartree
zpe.thermalcorrgfe: 0.229075 hartree
zpe.sumelectzpe: -948.926717 hartree
zpe.sumelectthermal: -948.908645 hartree
zpe.sumelectthermalent: -948.907700 hartree
zpe.sumelectthermalfe: -948.973606 hartree
dipole: 0.4771 5.4815 1.1088
dipole: 5.6128
quadrupole: -123.7618 -121.8128 -122.5624
quadrupole: 3.0919 -0.2665 -0.7106
quadrupole: -1.0495 0.8996 0.1499 3.0919 -0.2665 -0.7106
hfenergy: -949.2026806 hartree
pointgroup: C01 [X(C17H14N4O1)]
dipole: -0.1447154 2.1975805 -0.1615108 debye
polarizability: 287.8451521|-23.0568679|240.9251129|20.958881|25.2201776|142.0620332 unknown
InChI: InChI=1S/C17H14N4O/c18-16-14(17(19)22)13(11-7-3-1-4-8-11)15(20-21-16)12-9-5-2-6-10-12/h1-10H,18-19H2
charge 0 multiplicity 1
36 atoms
O  4.413347 -0.107052 0.42415
N  0.094625 -2.591574 -0.529763
N  1.378418 -2.989547 -0.448215
N  3.609476 -2.598449 0.058366
N  3.157087 1.541192 -0.573436
C  0.720093 -0.253894 -0.097511
C  -0.269527 -1.278028 -0.283588
C  0.301249 1.18004 0.025464
C  2.089446 -0.644968 -0.053299
C  -1.748169 -1.067753 -0.267896
C  2.36958 -2.061651 -0.122741
C  -0.356403 1.835636 -1.049797
C  0.548148 1.903166 1.224079
C  -2.553287 -1.802426 -1.181427
C  -2.390802 -0.21432 0.669018
C  3.276621 0.283602 -0.026372
C  -0.754556 3.186206 -0.929717
C  0.139511 3.248647 1.346536
C  -0.510849 3.896405 0.269029
C  -3.957046 -1.666101 -1.177079
C  -3.796257 -0.082622 0.675777
C  -4.586381 -0.801249 -0.250791
H  -0.565872 1.281373 -1.97105
H  1.054611 1.404445 2.058116
H  -2.060824 -2.489199 -1.876562
H  -1.79864 0.334975 1.406856
H  -1.261735 3.677961 -1.766863
H  0.329125 3.79072 2.279501
H  -0.826692 4.941056 0.364256
H  -4.560054 -2.236897 -1.892249
H  -4.273642 0.575871 1.410232
H  -5.677157 -0.695517 -0.245412
H  3.712961 -3.603413 -0.076533
H  4.372188 -1.968395 0.338356
H  2.270457 1.913676 -0.91135
H  3.984952 2.137184 -0.559683
