program: Gaussian 09
title: 000254370
version: EM64L-G09RevD.01
frameworkgroup: C1[X(C11H7N3O)]
method: RPBEPBE
basis: SDD
operation: Freq
keyword: #p
keyword: freq=noraman
keyword: PBEPBE/SDD
title: #p freq=noraman PBEPBE/SDD
converged: YES YES NO NO
title: Mulliken charges:
elementType: O N N N C C C C C C C C C C C H H H H H H H
charge: -0.183951 -0.416047 0.018903 0.028806 -0.364536 0.300565 0.261250 0.070993 -0.121084 -0.394323 -0.335247 -0.249807 -0.196024 -0.142665 -0.154542 0.299866 0.293897 0.332130 0.237685 0.244650 0.234995 0.234487
chargesum: 0.00000
title: Mulliken charges with hydrogens summed into heavy atoms:
elementType: O N N N C C C C C C C C C C C
charge: -0.183951 -0.083917 0.018903 0.028806 -0.064670 0.300565 0.261250 0.070993 0.172812 -0.156638 -0.090596 -0.014812 0.038463 -0.142665 -0.154542
polarizability: 1.76478242e+02 1.38057933e+01 1.15911086e+02 -1.53184941e+01 1.22641611e+01 8.95421335e+01
1716.lowfreq: -10.7877 -6.4495 -4.1858 -0.0002 0.0006 0.0008 37.7102 53.7660 87.2664
frequency: 37.6987 53.7576 87.2631 104.0707 129.5223 163.5212 215.9469 262.2655 285.0574 335.5796 360.9719 431.6893 443.5772 479.2532 500.6718 528.7994 560.3048 564.2081 614.1580 643.0381 662.1690 723.9023 736.0350 760.2653 800.8401 839.6579 867.3427 879.8708 908.1619 939.5033 982.9197 1009.9709 1020.3033 1046.8977 1098.8766 1158.7133 1172.8442 1181.5173 1204.0009 1236.7858 1239.1652 1259.1004 1288.8779 1304.8172 1342.7794 1416.3514 1463.3436 1478.1839 1610.4395 1632.3276 1677.0664 2210.9097 2212.1883 2984.7861 3019.8305 3126.5000 3140.6283 3155.8860 3172.4072 3579.3628
redmass: 9.9219 6.0036 7.0574 12.2532 10.6128 6.8880 7.0088 6.7765 5.4206 5.7716 7.9710 3.3599 9.6068 8.8064 4.2040 4.5025 10.4674 2.6722 6.7444 1.6058 6.0954 2.9453 5.0517 1.5051 4.3538 3.4440 1.6424 4.5132 4.5609 1.4164 1.3235 3.3454 2.1148 5.0359 2.0916 1.4597 1.1374 1.5307 1.4868 2.8794 1.7191 1.3655 2.0965 1.5309 1.9984 3.5507 2.8276 3.1360 6.7731 7.2457 10.0075 12.5473 12.6000 1.0807 1.0836 1.0893 1.0881 1.0942 1.1002 1.0797
irintensity: 0.6233 1.5267 1.1646 1.1037 4.7017 0.3282 1.8399 6.2540 6.7631 1.1881 0.1557 9.0868 0.2428 3.2878 7.7552 13.9643 1.0724 12.0603 1.9041 111.7759 13.6699 11.7104 0.6218 90.0045 2.2127 5.7215 2.6101 4.7244 7.4995 2.1469 0.1977 6.4055 4.9503 8.5537 21.3595 31.1943 1.5192 17.4023 49.6131 30.8280 6.5058 10.6623 9.7859 13.0596 27.9696 2.0770 41.4462 69.9861 2.1983 93.5281 390.4435 0.2435 0.7827 0.1499 1.6037 6.5052 4.6954 16.2510 16.6130 53.2643
temp: 298.150 k
press: 1.00000 atm
elementType: 8 7 7 7 6 6 6 6 6 6 6 6 6 6 6 1 1 1 1 1 1 1
symmnumber: 1
zpe: 408805.1 jmol-1
zpe.correction: 0.155706 hartree
zpe.thermalcorrener: 0.168178 hartree
zpe.thermalcorrenthalpy: 0.169123 hartree
zpe.thermalcorrgfe: 0.115903 hartree
zpe.sumelectzpe: -661.797730 hartree
zpe.sumelectthermal: -661.785257 hartree
zpe.sumelectthermalent: -661.784313 hartree
zpe.sumelectthermalfe: -661.837533 hartree
dipole: -7.0315 -1.1636 -2.0719
dipole: 7.4222
quadrupole: -99.3409 -77.7720 -94.4817
quadrupole: -6.9288 -1.5343 7.8882
quadrupole: -8.8093 12.7595 -3.9502 -6.9288 -1.5343 7.8882
hfenergy: -661.9534355 hartree
pointgroup: C01 [X(C11H7N3O1)]
dipole: -2.7742557 0.2632247 0.8725293 debye
dipolederiv: -1.1581577 0.376532 0.0256722 0.4194372 -0.6911359 -0.0546817 0.0647133 -0.1131354 -0.3457296 -1.4226839 0.4799769 0.0741715 0.0693167 -0.4890925 -0.0331932 -0.2211715 0.0394231 -0.298275 -0.1682063 0.0047245 0.0104895 -0.0020892 -0.1911945 -0.0025242 0.0177033 0.0295082 -0.1202299 -0.1634847 -0.057641 -0.0208276 -0.0409956 -0.1824306 -0.0122669 -0.0310724 -0.0232102 -0.193157 0.1372216 0.1112727 -0.0670471 0.0825223 -0.1103995 -0.1608733 -0.1141756 -0.2021596 0.0264755 0.0809817 -0.0848377 -0.0326662 0.1406341 -0.2457428 -0.0122576 0.2442358 -0.0753755 -0.1022119 0.6004556 -0.4869565 -0.1696223 -0.657325 0.5369851 0.0920418 -0.2832907 0.1303898 0.1139263 1.8477659 -0.5405982 0.075955 -0.0780622 0.6974797 0.1728173 0.4063725 0.215014 0.2925884 0.291974 0.0498844 0.0473086 0.0821816 0.3122404 -0.0062634 0.0490906 -0.0163769 0.320647 0.0863166 0.0234028 0.0738186 -0.0915294 0.0527212 0.0956029 -0.0004427 0.1176865 -0.0433831 -0.2317524 0.2132609 0.1280304 0.0773572 -0.0949323 0.0752977 0.031696 0.1139375 -0.0949878 -0.1635486 -0.067023 -0.0237863 -0.0938107 -0.0651593 0.0485119 -0.0530041 0.042621 -0.1543241 0.1348296 -0.0781418 0.0335594 0.0148896 0.0383156 0.1013616 0.0868382 0.0837278 -0.0593594 -0.1202104 -0.0242298 0.0104423 -0.0202375 -0.0411141 0.0009635 -0.0444789 -0.0262209 0.0118074 -0.0134791 0.0054113 0.0513565 -0.0244384 -0.0093919 0.0408996 0.0958123 0.0496336 -0.0967758 0.027174 0.0081131 -0.0257064 0.0237998 0.0625306 0.0283546 -0.033971 0.0194809 -0.0106219 0.0691069 0.0392105 -0.0137297 0.0321784 0.0320528 -0.0203014 -0.0180088 -0.0131037 0.0334909 0.127172 0.0196407 -0.0340704 0.0392916 0.256023 -0.0502259 -0.0440788 -0.0651226 0.2939683 0.0570718 -0.0714113 -0.0749441 -0.0511682 0.0146754 -0.0867029 -0.0578023 -0.0931716 0.0779304 0.0692852 -0.026285 -0.0377626 -0.0399936 0.0091066 -0.1097469 -0.058179 -0.1091061 0.0975933 0.0156393 0.0871678 0.021157 0.1012818 -0.0002763 -0.0810718 0.0214565 -0.0793974 0.123097 -0.103471 0.0185267 -0.0517982 0.0167597 0.1087392 -0.0257417 -0.0582426 -0.0250424 0.1275308 unknown
polarizability: 176.7381866|-15.7196397|110.0704919|12.6716136|16.3321427|95.1227833 unknown
InChI: InChI=1S/C11H7N3O/c12-5-7(6-13)10-8-3-1-2-4-9(8)14-11(10)15/h1-4,7,10,14H
charge 0 multiplicity 1
22 atoms
O  1.804574 -2.179873 -0.162603
N  -0.515293 -1.847924 -0.52931
N  1.267117 1.375178 -2.344543
N  4.085867 0.506847 0.983834
C  0.565249 -0.192715 0.780436
C  -0.904907 0.140758 0.585574
C  -1.501234 -0.884296 -0.199086
C  0.746274 -1.525854 -0.010909
C  1.543297 0.93221 0.278164
C  -1.68083 1.214103 1.04739
C  -2.864783 -0.861175 -0.538994
C  -3.059588 1.2575 0.712542
C  -3.637627 0.231092 -0.07107
C  1.404189 1.17469 -1.178321
C  2.955256 0.670103 0.646066
H  0.813834 -0.384449 1.841537
H  1.246742 1.869085 0.794114
H  -0.668463 -2.672436 -1.110599
H  -1.240801 2.009226 1.660985
H  -3.320772 -1.650955 -1.144622
H  -3.679437 2.089015 1.062242
H  -4.702465 0.278772 -0.323127
