program: Gaussian 09
title: 000250348
version: EM64L-G09RevD.01
frameworkgroup: C1[X(C20H18N2O2)]
method: RPBEPBE
basis: SDD
operation: Freq
keyword: #p
keyword: freq=noraman
keyword: PBEPBE/SDD
title: #p freq=noraman PBEPBE/SDD
converged: YES YES NO NO
title: Mulliken charges:
elementType: O O N N C C C C C C C C C C C C C C C C C C C C H H H H H H H H H H H H H H H H H H
charge: -0.173319 -0.193470 -0.213376 -0.316449 -0.366201 0.331128 -0.577649 0.137079 0.115805 0.111205 0.211939 0.142700 -0.802562 -0.370472 0.492143 -0.360137 -0.662495 -0.278765 -0.228172 -0.341389 -0.345265 -0.223998 -0.222358 -0.241679 0.243931 0.285645 0.266306 0.237591 0.237948 0.247512 0.224414 0.234327 0.238975 0.243285 0.250093 0.221945 0.221269 0.266612 0.267652 0.229268 0.228726 0.230258
chargesum: 0.00000
title: Mulliken charges with hydrogens summed into heavy atoms:
elementType: O O N N C C C C C C C C C C C C C C C C C C C C
charge: -0.173319 -0.193470 -0.213376 -0.316449 -0.122270 0.331128 -0.025698 0.137079 0.115805 0.111205 0.211939 0.142700 -0.079512 -0.146058 0.492143 -0.125810 0.069858 -0.056820 -0.006903 -0.074777 -0.077612 0.005270 0.006368 -0.011421
polarizability: 2.92902901e+02 -2.59815701e+01 2.36591396e+02 4.83052987e-02 1.25614446e+01 1.71102429e+02
1716.lowfreq: -15.3708 -5.4652 -0.0007 -0.0003 0.0005 2.0170 13.0875 16.3035 37.3107
frequency: 12.6793 14.3583 37.3037 54.6055 69.4575 78.7428 100.7809 119.6817 130.7201 135.9736 160.0028 166.8612 181.3480 217.3267 259.7721 276.5171 291.0129 306.7352 309.7863 358.9073 386.2192 404.3111 435.4490 444.0959 472.2318 489.0463 525.1625 550.7404 555.6865 576.3666 588.9755 594.0403 601.6194 612.3088 643.1577 667.7904 675.4449 691.6918 702.4599 747.7517 750.6323 765.6510 774.6104 781.6429 836.9125 848.0478 877.9864 900.3571 913.5657 927.2314 935.5795 969.0888 969.8808 990.5843 992.3147 1000.8066 1004.3330 1021.3228 1029.3780 1035.4714 1042.4253 1066.7314 1090.3259 1118.5116 1126.4552 1132.5206 1140.2201 1153.6530 1161.3184 1165.6171 1175.3652 1192.9243 1196.7284 1231.8558 1256.2562 1268.7313 1296.9787 1324.7575 1330.0191 1333.1193 1368.5700 1383.9221 1392.9291 1412.4340 1416.3716 1441.6837 1443.2045 1444.1805 1461.4927 1464.8505 1471.7726 1480.3687 1484.4974 1486.5733 1497.5035 1580.8902 1587.4070 1594.3374 1610.5559 1625.3645 1631.2000 1691.1031 2970.1262 2977.0491 3007.7294 3028.3085 3039.9967 3050.2897 3086.2642 3093.8110 3117.3345 3122.9249 3131.2520 3131.8831 3144.2640 3145.4765 3161.8643 3163.0531 3187.1138 3191.0884
redmass: 5.0001 5.4217 4.4064 5.6689 1.1744 4.1877 4.5228 3.1999 3.1305 2.8438 3.4450 1.2304 5.4343 4.0637 3.4519 5.4382 6.5868 3.8621 3.1816 6.0932 5.2248 2.8347 2.9022 6.3496 5.1405 4.3582 4.3643 3.3566 4.7614 3.8202 4.9569 5.1386 5.3209 6.1897 5.1628 4.3527 5.7136 1.9696 4.7410 1.4077 4.1818 1.9434 4.0772 3.7613 1.2532 1.5012 2.9008 4.7790 1.4542 1.4091 2.5298 1.3040 1.3978 5.9054 1.3963 3.8495 2.3120 2.0810 2.2514 2.2703 1.8121 2.6915 1.7361 1.3062 2.0371 1.6000 2.9550 1.7826 1.4192 1.9469 1.0506 2.0697 1.1378 1.4431 1.7687 1.4230 1.8957 5.6245 1.3209 1.9953 3.2896 9.1569 1.9435 2.5026 3.1399 1.3363 1.6619 1.3529 1.0462 1.6379 2.7190 1.0439 1.7301 2.2751 1.1602 6.6748 6.9888 6.3789 5.9588 7.6200 11.6007 12.6803 1.0394 1.0370 1.0820 1.0620 1.0982 1.1018 1.1017 1.0948 1.0964 1.0853 1.0855 1.0885 1.0908 1.0948 1.0972 1.1001 1.0947 1.0966
irintensity: 0.4451 0.2572 0.8414 0.9130 0.7750 4.6786 1.1185 0.4767 1.7664 4.0190 0.6757 0.3591 4.5837 0.5501 0.9848 1.4879 9.0298 1.0897 0.1901 0.3589 2.1463 0.3861 4.3560 6.4180 5.8569 4.2783 4.9995 2.0064 9.9998 0.8704 4.9292 7.0600 6.6984 0.8871 22.2245 6.8228 11.3502 41.5453 16.3325 88.0787 3.1459 62.8905 5.4826 15.1312 0.1851 0.6250 0.3951 5.0608 2.7991 0.9140 19.3721 0.1913 0.0644 0.4721 0.5610 0.7994 5.3364 11.5791 4.0434 12.8702 8.0795 6.7044 6.1055 1.9693 38.4340 62.4692 125.7153 45.0378 13.5450 49.7126 0.1216 3.2805 0.4689 5.5951 14.8982 11.7565 3.2410 295.7775 1.0627 7.4905 47.6097 0.7332 14.8593 23.6375 36.2016 5.5042 15.0301 13.0789 21.4068 22.2564 8.8030 0.9038 49.8000 74.4436 12.3425 18.9151 17.0537 9.9337 15.9272 66.3737 383.1428 13.2333 46.8221 82.9456 11.3841 7.1745 14.3964 26.0700 5.0934 22.9753 9.8865 5.4488 0.0499 4.7770 18.1846 39.0713 35.4584 26.7579 3.2513 0.8414
temp: 298.150 k
press: 1.00000 atm
elementType: 8 8 7 7 6 6 6 6 6 6 6 6 6 6 6 6 6 6 6 6 6 6 6 6 1 1 1 1 1 1 1 1 1 1 1 1 1 1 1 1 1 1
symmnumber: 1
zpe: 870271.7 jmol-1
zpe.correction: 0.331469 hartree
zpe.thermalcorrener: 0.352373 hartree
zpe.thermalcorrenthalpy: 0.353317 hartree
zpe.thermalcorrgfe: 0.279093 hartree
zpe.sumelectzpe: -1031.240124 hartree
zpe.sumelectthermal: -1031.219219 hartree
zpe.sumelectthermalent: -1031.218275 hartree
zpe.sumelectthermalfe: -1031.292499 hartree
dipole: 4.1958 -2.0690 -0.4641
dipole: 4.7012
quadrupole: -111.7744 -126.0186 -151.6771
quadrupole: -10.6221 5.1779 -1.0022
quadrupole: 18.0490 3.8047 -21.8537 -10.6221 5.1779 -1.0022
hfenergy: -1031.5715926 hartree
pointgroup: C01 [X(C20H18N2O2)]
dipole: -1.6055529 -0.8909846 0.2220789 debye
polarizability: 289.9614933|28.9059965|238.094199|-0.307999|-15.8284747|172.5410335 unknown
InChI: InChI=1S/C20H18N2O2/c1-13-19(15-10-6-7-11-17(15)21(13)2)16-12-18(23)22(20(16)24)14-8-4-3-5-9-14/h3-11,16H,12H2,1-2H3
charge 0 multiplicity 1
42 atoms
O  0.789505 -1.15921 1.597135
O  2.373024 -0.178655 -2.731647
N  -3.868591 -0.736617 0.43093
N  1.875945 -0.522761 -0.425693
C  -0.338302 -1.487323 -0.608754
C  -1.680297 -0.918672 -0.220248
C  0.175038 -1.088455 -2.018289
C  -2.819387 -1.642657 0.157787
C  -2.026604 0.491392 -0.171055
C  0.795113 -1.052491 0.352372
C  -3.403335 0.571199 0.235265
C  1.588189 -0.546924 -1.828176
C  -3.016864 -3.125646 0.295468
C  -1.314222 1.695704 -0.4147
C  3.113137 -0.030287 0.135253
C  -4.07823 1.801254 0.390552
C  -5.224849 -1.064606 0.871684
C  -1.980748 2.927615 -0.262102
C  -3.348773 2.980979 0.133446
C  3.740981 1.102758 -0.438756
C  3.691973 -0.677494 1.254649
C  4.94982 1.581304 0.108945
C  4.897405 -0.183137 1.797066
C  5.532534 0.944288 1.228211
H  -0.383253 -2.590032 -0.527153
H  -0.450519 -0.303385 -2.476785
H  0.205426 -1.931688 -2.728528
H  -3.814779 -3.505889 -0.371466
H  -2.089431 -3.661659 0.037453
H  -3.279272 -3.413902 1.33149
H  -0.256826 1.680406 -0.703272
H  -5.126926 1.848085 0.703339
H  -5.976194 -0.666102 0.164615
H  -5.427253 -0.642256 1.873863
H  -5.348768 -2.15644 0.926359
H  -1.439713 3.862702 -0.443946
H  -3.83922 3.954378 0.245015
H  3.300831 1.592405 -1.310133
H  3.198659 -1.54171 1.704361
H  5.434055 2.454934 -0.340608
H  5.339307 -0.683298 2.665653
H  6.469512 1.321691 1.652001
