program: Gaussian 09
title: 000254387
version: EM64L-G09RevD.01
frameworkgroup: C1[X(C15H28O5)]
method: RPBEPBE
basis: SDD
operation: Freq
keyword: #pfreq=noraman
keyword: PBEPBE/SDD
title: #p freq=noraman PBEPBE/SDD
converged: YES YES NO NO
title: Mulliken charges:
elementType: O O O O O C C C C C C C C C C C C C C C H H H H H H H H H H H H H H H H H H H H H H H H H H H H
charge: -0.265102 -0.236192 -0.217721 -0.239222 -0.274799 -0.383014 -0.382030 -0.384589 -0.372641 -0.377700 -0.353260 -0.373972 -0.356604 -0.324136 -0.696348 0.258421 -0.108164 -0.699121 0.333322 -0.505673 0.192591 0.194799 0.192639 0.193779 0.196260 0.201688 0.189251 0.189863 0.200907 0.191448 0.187743 0.188251 0.211026 0.239166 0.194996 0.194538 0.232825 0.226394 0.209629 0.209892 0.215080 0.263035 0.240198 0.234897 0.241177 0.238492 0.246960 0.241020
chargesum: 0.00000
title: Mulliken charges with hydrogens summed into heavy atoms:
elementType: O O O O O C C C C C C C C C C C C C C C
charge: -0.265102 -0.236192 -0.217721 -0.239222 -0.274799 0.004376 0.004388 0.013360 0.006473 0.014656 0.022735 0.076219 0.032930 0.135082 -0.061747 0.258421 0.154871 0.017150 0.333322 0.220799
polarizability: 2.22500773e+02 -1.03078595e+00 1.80835208e+02 2.61053506e+00 4.20279616e+00 1.43309305e+02
1716.lowfreq: -7.9339 -5.3104 -0.0011 -0.0004 0.0008 3.6728 10.2401 17.3803 24.9352
frequency: 9.3743 17.2385 24.8855 29.9870 37.0188 48.8946 59.4292 67.8181 74.5652 80.5863 97.6006 108.8544 112.7462 115.9509 136.3019 141.4584 148.3496 154.6717 161.5675 202.6363 214.0778 220.2847 223.4851 253.6519 273.9568 310.9585 320.6816 326.9290 369.7335 390.4450 426.8296 480.1234 495.4287 566.7391 620.6014 654.0403 692.4803 704.9810 720.8326 725.1911 737.1429 757.0762 784.4546 806.2740 841.6672 849.1121 875.5035 887.7703 907.7943 923.1136 971.4165 986.0983 999.5180 1013.9812 1023.1959 1027.6733 1050.3313 1052.9088 1065.7050 1079.5196 1080.0129 1082.1229 1087.2054 1116.2873 1118.4291 1124.3579 1148.7621 1156.3422 1168.2952 1187.3516 1203.0420 1209.8715 1216.8042 1245.3294 1247.5461 1272.8263 1277.7567 1279.6210 1287.0928 1287.7805 1289.7416 1295.3845 1297.4136 1310.0374 1322.1320 1336.1583 1351.9792 1355.1024 1357.8490 1370.1542 1388.5671 1391.3613 1427.6875 1453.8472 1454.1563 1460.2705 1460.5160 1463.4264 1464.4943 1464.9278 1466.0369 1470.4601 1475.6785 1476.0190 1477.8341 1481.6378 1486.7850 1489.0352 1629.8950 1658.2114 2949.5864 2950.1857 2952.7289 2954.7333 2958.6256 2964.9147 2968.1114 2971.6517 2982.9912 2988.3844 2993.4763 2996.0803 3004.6633 3006.1436 3007.5327 3018.0413 3021.3627 3030.9535 3038.7600 3041.1068 3056.5335 3068.0592 3070.3055 3103.0664 3109.1640 3112.4478 3117.7598 3153.8392
redmass: 4.5339 4.1877 4.3990 1.5960 5.1628 4.1250 4.3241 2.0077 2.2047 2.2730 1.7837 1.8944 3.5453 2.2331 4.0056 1.9216 2.1048 3.9734 4.1077 2.5879 1.6063 1.1492 2.2298 3.4465 3.7038 3.6094 3.6317 7.4441 4.3013 3.9928 3.4439 3.4098 3.3172 4.6582 5.4516 6.7149 7.3732 5.6996 1.0607 1.0752 1.0927 1.1403 1.6338 1.7429 3.9274 1.3608 6.8123 1.9016 1.3191 3.7393 1.1888 5.0783 4.0871 2.4835 1.1066 3.8221 2.6380 3.1166 2.9721 2.2892 2.1301 2.9210 2.8597 2.9076 1.2727 2.9796 2.3658 1.5309 1.7999 1.6859 4.4739 1.2804 1.4465 1.3006 1.3152 1.2387 1.2534 1.0376 1.5357 1.0767 1.1596 1.0925 1.1247 1.3128 1.3669 1.4004 1.5384 1.6780 1.6307 1.3852 1.2172 1.2142 1.1881 1.0928 1.0496 1.0748 1.0736 1.0515 1.0650 1.0513 1.0719 1.0792 1.0581 1.0638 1.0535 1.0869 1.0925 1.0971 9.5247 10.2274 1.0587 1.0587 1.0593 1.0588 1.0593 1.0591 1.0586 1.0365 1.0963 1.0975 1.0667 1.0930 1.1020 1.0299 1.0348 1.1041 1.0579 1.1047 1.0846 1.1045 1.1036 1.1006 1.0993 1.1084 1.1051 1.1012 1.1006 1.1045
irintensity: 0.0876 0.1557 0.3260 0.0449 0.6059 1.6155 2.2685 0.2213 1.2332 0.9292 0.4956 0.1045 1.5446 0.3427 2.9877 0.0745 0.1315 1.4670 1.6287 0.0985 1.0872 0.0291 1.2376 0.9227 14.7770 4.1132 1.6451 23.5712 16.2685 3.5986 2.4811 0.2065 2.3281 1.8037 8.8326 4.4958 16.4154 14.4820 15.6404 0.0986 6.8541 0.6115 3.1039 1.0755 6.6761 2.0998 35.2769 4.8866 5.5727 40.1410 1.5731 3.4002 3.3275 25.4663 0.7648 2.6186 36.1884 2.7605 12.1328 5.5105 5.4408 231.2949 188.1623 82.7128 2.1386 1.8728 236.6200 7.8373 6.3771 1.5885 501.5024 15.7400 2.5003 0.6022 2.3576 0.5031 1.8467 0.3547 20.1320 1.7271 1.2043 0.1405 0.3186 0.9088 29.1237 0.6893 0.8922 0.1523 0.3714 1.7983 11.1773 20.2833 31.5733 7.2980 13.6410 0.0590 0.2067 13.0967 1.1655 13.5295 0.5617 0.7033 8.0703 5.9194 15.9392 1.7858 1.1140 40.0219 274.4627 113.8984 0.1527 0.2229 0.1196 6.8841 2.7942 35.8939 205.1965 36.7874 0.3597 0.2716 15.2533 5.4500 0.7615 36.0968 11.3082 3.2043 44.5405 0.6986 4.8232 168.9666 53.4363 97.7136 55.6552 28.3479 24.8098 19.3695 15.1374 15.9994
temp: 298.150 k
press: 1.00000 atm
elementType: 8 8 8 8 8 6 6 6 6 6 6 6 6 6 6 6 6 6 6 6 1 1 1 1 1 1 1 1 1 1 1 1 1 1 1 1 1 1 1 1 1 1 1 1 1 1 1 1
symmnumber: 1
zpe: 1080685.4 jmol-1
zpe.correction: 0.411611 hartree
zpe.thermalcorrener: 0.437199 hartree
zpe.thermalcorrenthalpy: 0.438143 hartree
zpe.thermalcorrgfe: 0.349881 hartree
zpe.sumelectzpe: -962.882742 hartree
zpe.sumelectthermal: -962.857155 hartree
zpe.sumelectthermalent: -962.856211 hartree
zpe.sumelectthermalfe: -962.944472 hartree
dipole: -1.2185 -0.8206 -1.1428
dipole: 1.8612
quadrupole: -125.8243 -106.4343 -126.8991
quadrupole: 2.7246 -7.5622 1.9097
quadrupole: -6.1051 13.2849 -7.1798 2.7246 -7.5622 1.9097
hfenergy: -963.2943535 hartree
pointgroup: C01 [X(C15H28O5)]
dipole: 0.5109031 -0.3028958 -0.4283008 debye
polarizability: 222.3271091|-1.7028013|145.2096284|2.9892371|-9.4308852|179.1085486 unknown
InChI: InChI=1S/C15H28O5/c1-4-5-6-7-8-9-10-11-12-19-14(16)13(2)20-15(17)18-3/h13H,4-12H2,1-3H3
charge 0 multiplicity 1
48 atoms
O  -2.179992 0.254195 -2.207391
O  -5.177768 -0.149653 -0.131987
O  -2.769382 1.313166 -0.206081
O  -5.53201 -0.604753 2.019803
O  -3.670366 -1.58133 0.971115
C  4.002922 0.478489 -0.519362
C  5.02945 -0.366188 0.268601
C  2.594706 -0.155732 -0.560324
C  6.43571 0.272331 0.321422
C  1.570056 0.689242 -1.350868
C  7.463017 -0.572504 1.108309
C  0.159691 0.054219 -1.364494
C  8.867395 0.070664 1.168699
C  -0.829765 0.903633 -2.170897
C  9.888312 -0.781956 1.952945
C  -3.03254 0.536025 -1.145475
C  -4.3441 -0.242652 -1.353152
C  -5.192357 0.338789 -2.490424
C  -4.683827 -0.846909 0.960861
C  -5.140315 -1.274385 3.28341
H  4.370408 0.626789 -1.556587
H  3.936475 1.489611 -0.065706
H  5.10182 -1.375372 -0.188573
H  4.658383 -0.520642 1.303453
H  2.660138 -1.168217 -1.010383
H  2.225944 -0.299298 0.476309
H  6.806955 0.429022 -0.713264
H  6.363067 1.280623 0.780729
H  1.515018 1.704211 -0.90546
H  1.932478 0.821315 -2.392039
H  7.541646 -1.579226 0.646512
H  7.090718 -0.734081 2.141785
H  0.208753 -0.962122 -1.800664
H  -0.213106 -0.050002 -0.328279
H  8.78787 1.074877 1.633314
H  9.237288 0.235257 0.13587
H  -0.937797 1.913616 -1.735344
H  -0.545087 0.973525 -3.233734
H  10.011283 -1.778802 1.488621
H  9.555016 -0.938314 2.996438
H  10.882372 -0.29888 1.984514
H  -4.082583 -1.300079 -1.539684
H  -5.456768 1.388246 -2.278056
H  -4.628272 0.291778 -3.436473
H  -6.122974 -0.242987 -2.595311
H  -5.917517 -0.980922 4.00203
H  -4.14668 -0.922793 3.607715
H  -5.116586 -2.368721 3.14736
