program: Gaussian 09
title: 000254376
version: EM64L-G09RevD.01
frameworkgroup: C1[X(C10H20NO3P)]
method: RPBEPBE
basis: SDD
operation: Freq
keyword: #p
keyword: freq=noraman
keyword: PBEPBE/SDD
title: #p freq=noraman PBEPBE/SDD
converged: YES YES NO NO
title: Mulliken charges:
elementType: P O O O N C C C C C C C C C C H H H H H H H H H H H H H H H H H H H H
charge: 1.286502 -0.506588 -0.528492 -0.625297 -0.015990 -0.312741 -0.795624 -0.342576 -0.380322 -0.428172 -0.219445 -0.255126 -0.658780 -0.651519 -0.156757 0.235946 0.220525 0.286805 0.260485 0.193303 0.199560 0.223406 0.228125 0.246827 0.249548 0.197823 0.227923 0.223118 0.240439 0.205244 0.234302 0.232816 0.217390 0.252233 0.215109
chargesum: 0.00000
title: Mulliken charges with hydrogens summed into heavy atoms:
elementType: P O O O N C C C C C C C C C C
charge: 1.286502 -0.506588 -0.528492 -0.625297 -0.015990 0.143731 -0.248334 0.050287 0.071209 0.068203 0.206301 0.208431 0.013582 0.033213 -0.156757
polarizability: 1.87259708e+02 6.37031658e+00 1.35827377e+02 6.71209370e+00 -5.19282758e-01 1.19618770e+02
1716.lowfreq: -7.3492 -5.0249 0.0015 0.0017 0.0018 12.2981 15.9606 32.1162 36.4314
frequency: 14.8934 32.0169 36.2819 42.0293 49.9492 55.2927 71.3204 83.8780 104.6290 117.0308 125.5339 133.8747 159.1185 166.0728 203.6886 221.9473 243.4149 246.9263 282.6572 317.9358 348.4852 366.6465 371.7873 405.1128 423.6031 466.8583 535.9661 601.3454 661.5935 731.7231 735.9889 753.2139 802.9499 809.4331 813.5589 860.0093 880.1137 920.4181 924.1044 1000.8081 1016.3960 1022.2009 1028.5018 1048.0288 1057.4255 1075.0636 1086.0283 1092.4050 1104.2185 1125.1951 1131.8727 1145.7791 1222.9091 1223.4422 1255.1163 1268.0024 1273.4479 1273.9972 1292.1274 1301.9955 1313.2385 1349.7867 1355.1472 1355.4874 1362.7858 1391.7799 1392.9986 1423.3742 1448.5335 1455.6905 1462.0654 1465.0847 1467.2704 1474.5204 1476.1518 1481.8810 1487.6197 1492.0833 2198.8820 2959.2881 2959.7216 2985.1881 2985.6159 2987.3229 2994.2221 2999.4053 3005.4064 3009.1052 3020.6365 3033.8730 3034.5939 3045.5680 3068.6865 3077.2183 3081.7943 3090.0129 3091.2561 3105.1350 3108.6881
redmass: 4.3957 2.8502 3.5187 3.3099 2.4403 2.4817 2.4379 3.2918 4.4766 2.4236 2.0499 3.7743 4.1651 3.5322 3.4530 1.7793 1.3523 1.8696 3.8675 4.8251 4.7590 4.2444 3.5404 4.6847 3.7097 4.9789 5.6638 5.9143 6.6780 1.1037 3.3088 1.2801 1.1227 1.1230 1.2854 3.3421 3.5472 5.0215 1.4366 4.3135 3.0932 3.1709 2.6786 3.2379 4.3364 2.4521 2.0400 2.1303 2.2177 1.2573 1.4303 1.5605 1.3434 1.2558 1.1464 1.2952 1.1803 1.1170 1.0603 1.1023 1.3437 1.3832 1.2170 1.2863 1.5007 1.2280 1.2403 1.0811 1.0817 1.0401 1.0482 1.0666 1.0671 1.0756 1.0663 1.0517 1.0931 1.0832 12.4344 1.0592 1.0599 1.0357 1.0590 1.0600 1.0365 1.0601 1.0991 1.0615 1.0577 1.1028 1.1010 1.1038 1.1048 1.1028 1.0977 1.1041 1.0984 1.1046 1.1016
irintensity: 1.2468 0.1159 3.1231 2.9499 0.1730 1.9630 3.2660 2.5668 3.5043 2.8298 0.1859 0.5530 19.8853 2.3378 0.9948 0.0888 1.6101 3.0117 19.1556 6.8033 7.3102 5.4307 0.4793 11.8936 6.9226 38.5532 1.4835 47.7376 116.5096 7.8476 45.3649 17.9145 5.1839 3.1508 4.3816 149.4351 113.8161 1.4154 7.4543 10.4685 149.6866 133.6410 22.8480 4.7515 0.5521 0.3842 40.5493 13.9984 16.4779 9.0005 4.4079 8.5828 10.1424 22.1382 0.8466 1.5494 0.6511 0.0570 0.3144 1.3003 0.8799 3.4858 10.7105 3.5835 0.3353 26.9294 22.5188 10.9755 6.9969 10.4109 12.6543 5.5297 0.0249 2.6348 1.4893 13.4162 30.3601 1.1419 14.4135 16.0809 51.8318 15.4681 6.4403 4.8430 24.2491 37.4836 9.9366 34.4635 12.3999 25.3729 0.4643 7.2955 51.3073 1.7493 43.1749 11.5067 32.3236 35.9769 33.2277
temp: 298.150 k
press: 1.00000 atm
elementType: 15 8 8 8 7 6 6 6 6 6 6 6 6 6 6 1 1 1 1 1 1 1 1 1 1 1 1 1 1 1 1 1 1 1 1
symmnumber: 1
zpe: 763597.2 jmol-1
zpe.correction: 0.290839 hartree
zpe.thermalcorrener: 0.311035 hartree
zpe.thermalcorrenthalpy: 0.311980 hartree
zpe.thermalcorrgfe: 0.238082 hartree
zpe.sumelectzpe: -1013.467258 hartree
zpe.sumelectthermal: -1013.447061 hartree
zpe.sumelectthermalent: -1013.446117 hartree
zpe.sumelectthermalfe: -1013.520015 hartree
dipole: -3.4938 0.4424 -5.5344
dipole: 6.5599
quadrupole: -131.0227 -95.6590 -107.8272
quadrupole: -10.5182 -6.2868 1.0280
quadrupole: -19.5197 15.8440 3.6758 -10.5182 -6.2868 1.0280
hfenergy: -1013.7580964 hartree
pointgroup: C01 [X(C10H20N1O3P1)]
dipole: 1.2692214 -0.5296424 2.1838815 debye
polarizability: 185.6952548|-11.2490626|135.3865479|7.1929592|4.1542201|121.6240521 unknown
InChI: InChI=1S/C10H20NO3P/c1-3-13-15(12,14-4-2)10-8-6-5-7-9-11/h3-8,10H2,1-2H3
charge 0 multiplicity 1
35 atoms
P  1.807243 -0.686136 -0.340706
O  2.08654 1.026309 -0.117869
O  2.905932 -1.487121 0.754148
O  1.958994 -1.081665 -1.873117
N  -6.951585 0.97736 -0.657654
C  -0.996527 -0.307698 -0.186517
C  0.173064 -1.056783 0.486257
C  -2.356364 -0.687599 0.442462
C  -3.531864 0.069796 -0.213476
C  -4.893702 -0.332467 0.41956
C  2.245028 1.581903 1.25386
C  4.219849 -1.942076 0.208053
C  2.749361 3.012937 1.082661
C  5.226095 -0.791788 0.100064
C  -6.036489 0.385926 -0.170712
H  -1.009295 -0.543515 -1.268565
H  -0.838711 0.78572 -0.105074
H  0.041845 -2.151461 0.416145
H  0.273983 -0.794264 1.554502
H  -2.33725 -0.470721 1.530952
H  -2.516367 -1.780852 0.340346
H  -3.386785 1.161192 -0.103132
H  -3.557607 -0.140821 -1.299253
H  -4.877711 -0.131581 1.508631
H  -5.060109 -1.420474 0.297366
H  1.263957 1.564177 1.773129
H  2.960732 0.958911 1.823637
H  4.544425 -2.706623 0.933119
H  4.049075 -2.416116 -0.777005
H  2.867082 3.497075 2.070144
H  3.724643 3.018656 0.567445
H  2.038412 3.605463 0.482345
H  6.203813 -1.181837 -0.240072
H  4.885655 -0.037211 -0.630566
H  5.372035 -0.301019 1.078492
